null
SMILES: CSCSc1nc(Cc2ccccc2)c(C(C)C)c(=O)[nH]1
InChI Key: InChIKey=XLGHKMOZFKHHSR-UHFFFAOYSA-N
Activity Spreadsheet -- Enzyme Inhibition Constant Data from BindingDB
Found 1 hit for monomerid = 50070469
Trg + Lig
Ki
nM
ΔG°
kcal/mole
IC50
nM
Kd
nM
EC50/IC50
nM
koff
s-1
kon
M-1s-1
pHTemp
°C
Reverse transcriptase/RNaseH
(Human immunodeficiency virus 1)
BDBM50070469
(6-Benzyl-5-isopropyl-2-methylsulfanylmethylsulfany...)
Show SMILES CSCSc1nc(Cc2ccccc2)c(C(C)C)c(=O)[nH]1
Show InChI InChI=1S/C16H20N2OS2/c1-11(2)14-13(9-12-7-5-4-6-8-12)17-16(18-15(14)19)21-10-20-3/h4-8,11H,9-10H2,1-3H3,(H,17,18,19)
n/an/a 6.10E+3n/an/an/an/an/an/a
Institute
Curated by ChEMBL
Assay Description
Compound was evaluated for enzymatic inhibitory activity against recombinant HIV reverse transcriptase
Bioorg Med Chem Lett 8: 1461-6 (1999)
BindingDB Entry DOI: 10.7270/Q24X56XN