null
SMILES: CC[C@H](C)[C@H](NC(=O)[C@H](CCCCN)NC(=O)c1cc(O)ccc1O)C(=O)N[C@@H](Cc1ccccc1)C(=O)NCCCC(O)=O
InChI Key: InChIKey=STPAXVLLCFADQC-HARPQRPWSA-N
Activity Spreadsheet -- Enzyme Inhibition Constant Data from BindingDB
Found 1 hit for monomerid = 50070681
Trg + Lig
Ki
nM
ΔG°
kcal/mole
IC50
nM
Kd
nM
EC50/IC50
nM
koff
s-1
kon
M-1s-1
pHTemp
°C
Prothrombin
(Homo sapiens (Human))
BDBM50070681
(CHEMBL2372666 | Nazumamide A (NAZA) analogue)
Show SMILES CC[C@H](C)[C@H](NC(=O)[C@H](CCCCN)NC(=O)c1cc(O)ccc1O)C(=O)N[C@@H](Cc1ccccc1)C(=O)NCCCC(O)=O
Show InChI InChI=1S/C32H45N5O8/c1-3-20(2)28(32(45)36-25(18-21-10-5-4-6-11-21)30(43)34-17-9-13-27(40)41)37-31(44)24(12-7-8-16-33)35-29(42)23-19-22(38)14-15-26(23)39/h4-6,10-11,14-15,19-20,24-25,28,38-39H,3,7-9,12-13,16-18,33H2,1-2H3,(H,34,43)(H,35,42)(H,36,45)(H,37,44)(H,40,41)/t20?,24-,25-,28-/m0/s1
n/an/a 1.10E+4n/an/an/an/a8.3n/a
Central Drug Research Institute
Curated by ChEMBL
Assay Description
Anti-thrombin activity by competitive enzyme assay using the fluorogenic substrate Tos-Gly-Pro-Arg-AMC at pH 8.3.
Bioorg Med Chem Lett 8: 1669-72 (1999)
BindingDB Entry DOI: 10.7270/Q2G73CV8