BDBM50071327 CHEMBL3410212
SMILES: C1Oc2ccccc2-n2cnc(C#Cc3cccnc3)c12
InChI Key: InChIKey=AEPFXRGRJZMVIF-UHFFFAOYSA-N
Data: 1 KI  1 IC50
Activity Spreadsheet -- Enzyme Inhibition Constant Data from BindingDB
Found 2 hits for monomerid = 50071327
Trg + Lig
Ki
nM
ΔG°
kcal/mole
IC50
nM
Kd
nM
EC50/IC50
nM
koff
s-1
kon
M-1s-1
pHTemp
°C
Metabotropic glutamate receptor 5
(Homo sapiens (Human))
BDBM50071327
(CHEMBL3410212)
Show SMILES C1Oc2ccccc2-n2cnc(C#Cc3cccnc3)c12
Show InChI InChI=1S/C17H11N3O/c1-2-6-17-15(5-1)20-12-19-14(16(20)11-21-17)8-7-13-4-3-9-18-10-13/h1-6,9-10,12H,11H2
255n/an/an/an/an/an/an/an/a
Roche Pharmaceutical Research and Early Development
Curated by ChEMBL
Assay Description
Displacement of [3H]MPEP from mGlu5 receptor (unknown origin) expressed in HEK293 cells by competition binding assay
J Med Chem 58: 1358-71 (2015)
Article DOI: 10.1021/jm501642c
BindingDB Entry DOI: 10.7270/Q2J96825
Metabotropic glutamate receptor 5
(Homo sapiens (Human))
BDBM50071327
(CHEMBL3410212)
Show SMILES C1Oc2ccccc2-n2cnc(C#Cc3cccnc3)c12
Show InChI InChI=1S/C17H11N3O/c1-2-6-17-15(5-1)20-12-19-14(16(20)11-21-17)8-7-13-4-3-9-18-10-13/h1-6,9-10,12H,11H2
n/an/a 387n/an/an/an/an/an/a
Roche Pharmaceutical Research and Early Development
Curated by ChEMBL
Assay Description
Negative allosteric modulation of mGlu5 (unknown origin) expressed in HEK293 cells assessed as inhibition of L-AP4-induced calcium mobilization incub...
J Med Chem 58: 1358-71 (2015)
Article DOI: 10.1021/jm501642c
BindingDB Entry DOI: 10.7270/Q2J96825