BDBM50071695 (S)-1-[((2R,3S)-1-Carbamimidoyl-2-hydroxy-piperidin-3-ylcarbamoyl)-methyl]-2-oxo-3-phenylmethanesulfonylamino-piperidine-3-carboxylic acid ethyl ester::CHEMBL85282
SMILES: CCOC(=O)[C@@]1(CCCN(CC(=O)N[C@H]2CCCN([C@@H]2O)C(N)=N)C1=O)NS(=O)(=O)Cc1ccccc1
InChI Key: InChIKey=YLPFNSPUPARBLY-GWJPWWOOSA-N
Data: 4 IC50
Activity Spreadsheet -- Enzyme Inhibition Constant Data from BindingDB
Found 4 hits for monomerid = 50071695
Trg + Lig
Ki
nM
ΔG°
kcal/mole
IC50
nM
Kd
nM
EC50/IC50
nM
koff
s-1
kon
M-1s-1
pHTemp
°C
Coagulation factor X
(Homo sapiens (Human))
BDBM50071695
((S)-1-[((2R,3S)-1-Carbamimidoyl-2-hydroxy-piperidi...)
Show SMILES CCOC(=O)[C@@]1(CCCN(CC(=O)N[C@H]2CCCN([C@@H]2O)C(N)=N)C1=O)NS(=O)(=O)Cc1ccccc1
Show InChI InChI=1S/C23H34N6O7S/c1-2-36-21(33)23(27-37(34,35)15-16-8-4-3-5-9-16)11-7-12-28(20(23)32)14-18(30)26-17-10-6-13-29(19(17)31)22(24)25/h3-5,8-9,17,19,27,31H,2,6-7,10-15H2,1H3,(H3,24,25)(H,26,30)/t17-,19+,23-/m0/s1
Reactome pathway
n/an/a 5.80n/an/an/an/an/an/a
Corvas International, Inc.
Curated by ChEMBL
Assay Description
In vitro inhibitory activity was evaluated against thrombin factor Xa (FXa)
Bioorg Med Chem Lett 8: 2501-6 (1999)
BindingDB Entry DOI: 10.7270/Q28C9VCK
Plasminogen
(Homo sapiens (Human))
BDBM50071695
((S)-1-[((2R,3S)-1-Carbamimidoyl-2-hydroxy-piperidi...)
Show SMILES CCOC(=O)[C@@]1(CCCN(CC(=O)N[C@H]2CCCN([C@@H]2O)C(N)=N)C1=O)NS(=O)(=O)Cc1ccccc1
Show InChI InChI=1S/C23H34N6O7S/c1-2-36-21(33)23(27-37(34,35)15-16-8-4-3-5-9-16)11-7-12-28(20(23)32)14-18(30)26-17-10-6-13-29(19(17)31)22(24)25/h3-5,8-9,17,19,27,31H,2,6-7,10-15H2,1H3,(H3,24,25)(H,26,30)/t17-,19+,23-/m0/s1
NCI pathway
Reactome pathway
n/an/a 271n/an/an/an/an/an/a
Corvas International, Inc.
Curated by ChEMBL
Assay Description
In vitro inhibitory activity was evaluated against thrombolytic enzyme plasmin
Bioorg Med Chem Lett 8: 2501-6 (1999)
BindingDB Entry DOI: 10.7270/Q28C9VCK
Prothrombin
(Homo sapiens (Human))
BDBM50071695
((S)-1-[((2R,3S)-1-Carbamimidoyl-2-hydroxy-piperidi...)
Show SMILES CCOC(=O)[C@@]1(CCCN(CC(=O)N[C@H]2CCCN([C@@H]2O)C(N)=N)C1=O)NS(=O)(=O)Cc1ccccc1
Show InChI InChI=1S/C23H34N6O7S/c1-2-36-21(33)23(27-37(34,35)15-16-8-4-3-5-9-16)11-7-12-28(20(23)32)14-18(30)26-17-10-6-13-29(19(17)31)22(24)25/h3-5,8-9,17,19,27,31H,2,6-7,10-15H2,1H3,(H3,24,25)(H,26,30)/t17-,19+,23-/m0/s1
n/an/a 1.10n/an/an/an/an/an/a
Corvas International, Inc.
Curated by ChEMBL
Assay Description
In vitro inhibitory activity was evaluated against thrombin (FIIa)
Bioorg Med Chem Lett 8: 2501-6 (1999)
BindingDB Entry DOI: 10.7270/Q28C9VCK
Trypsin-1
(Homo sapiens (Human))
BDBM50071695
((S)-1-[((2R,3S)-1-Carbamimidoyl-2-hydroxy-piperidi...)
Show SMILES CCOC(=O)[C@@]1(CCCN(CC(=O)N[C@H]2CCCN([C@@H]2O)C(N)=N)C1=O)NS(=O)(=O)Cc1ccccc1
Show InChI InChI=1S/C23H34N6O7S/c1-2-36-21(33)23(27-37(34,35)15-16-8-4-3-5-9-16)11-7-12-28(20(23)32)14-18(30)26-17-10-6-13-29(19(17)31)22(24)25/h3-5,8-9,17,19,27,31H,2,6-7,10-15H2,1H3,(H3,24,25)(H,26,30)/t17-,19+,23-/m0/s1
Reactome pathway
n/an/a 2n/an/an/an/an/an/a
Corvas International, Inc.
Curated by ChEMBL
Assay Description
In vitro inhibitory activity was evaluated against human trypsin cleavage of the chromogenic substrate
Bioorg Med Chem Lett 8: 2501-6 (1999)
BindingDB Entry DOI: 10.7270/Q28C9VCK