null
SMILES: Cc1ccc(NC(=O)CCCCC(=O)Nc2ccc(C)cc2C(O)=O)c(c1)C(O)=O
InChI Key: InChIKey=ZRLHQYRMFQVVEP-UHFFFAOYSA-N
Activity Spreadsheet -- Enzyme Inhibition Constant Data from BindingDB
Found 2 hits for monomerid = 50071770
Trg + Lig
Ki
nM
ΔG°
kcal/mole
IC50
nM
Kd
nM
EC50/IC50
nM
koff
s-1
kon
M-1s-1
pHTemp
°C
Reverse transcriptase/RNaseH
(Human immunodeficiency virus 1)
BDBM50071770
(2-[4-(2-carboxy-4-methylphenylcarbamoyl)butylcarbo...)
Show SMILES Cc1ccc(NC(=O)CCCCC(=O)Nc2ccc(C)cc2C(O)=O)c(c1)C(O)=O
Show InChI InChI=1S/C22H24N2O6/c1-13-7-9-17(15(11-13)21(27)28)23-19(25)5-3-4-6-20(26)24-18-10-8-14(2)12-16(18)22(29)30/h7-12H,3-6H2,1-2H3,(H,23,25)(H,24,26)(H,27,28)(H,29,30)
n/an/a 1.40E+4n/an/an/an/an/an/a
GlaxoWellcome Medicines Research Center
Curated by ChEMBL
Assay Description
Evaluated for inhibition of HIV-2 reverse transcriptase
Bioorg Med Chem Lett 8: 2623-8 (1999)
BindingDB Entry DOI: 10.7270/Q2RF5T6F
Reverse transcriptase/RNaseH
(Human immunodeficiency virus 1)
BDBM50071770
(2-[4-(2-carboxy-4-methylphenylcarbamoyl)butylcarbo...)
Show SMILES Cc1ccc(NC(=O)CCCCC(=O)Nc2ccc(C)cc2C(O)=O)c(c1)C(O)=O
Show InChI InChI=1S/C22H24N2O6/c1-13-7-9-17(15(11-13)21(27)28)23-19(25)5-3-4-6-20(26)24-18-10-8-14(2)12-16(18)22(29)30/h7-12H,3-6H2,1-2H3,(H,23,25)(H,24,26)(H,27,28)(H,29,30)
n/an/a 9.20E+3n/an/an/an/an/an/a
GlaxoWellcome Medicines Research Center
Curated by ChEMBL
Assay Description
Evaluated for inhibition of HIV-2 reverse transcriptase
Bioorg Med Chem Lett 8: 2623-8 (1999)
BindingDB Entry DOI: 10.7270/Q2RF5T6F