BDBM50071813 CHEMBL2179992
SMILES: Cc1sc2nc(SCC(=O)c3ccc(O)c(O)c3)[nH]c(=O)c2c1C
InChI Key: InChIKey=FBFZQTVPMLIDPV-UHFFFAOYSA-N
Data: 1 IC50
Activity Spreadsheet -- Enzyme Inhibition Constant Data from BindingDB
Found 1 hit for monomerid = 50071813
Trg + Lig
Ki
nM
ΔG°
kcal/mole
IC50
nM
Kd
nM
EC50/IC50
nM
koff
s-1
kon
M-1s-1
pHTemp
°C
Krueppel-like factor 10
(Homo sapiens (Human))
BDBM50071813
(CHEMBL2179992)
Show SMILES Cc1sc2nc(SCC(=O)c3ccc(O)c(O)c3)[nH]c(=O)c2c1C
Show InChI InChI=1S/C16H14N2O4S2/c1-7-8(2)24-15-13(7)14(22)17-16(18-15)23-6-12(21)9-3-4-10(19)11(20)5-9/h3-5,19-20H,6H2,1-2H3,(H,17,18,22)
n/an/a 4.30E+4n/an/an/an/an/an/a
Beth Israel Deaconess Medical Center
Curated by ChEMBL
Assay Description
Inhibition of human KLF10 expressed in human HeLa cells assessed as reduction in transcriptional activity after 24 hrs by CACCC-responsive promoter d...
J Med Chem 58: 1466-78 (2015)
Article DOI: 10.1021/jm5018187
BindingDB Entry DOI: 10.7270/Q2WM1G3D