BDBM50071863 CHEMBL3410874
SMILES: CN[C@@H](C)C(=O)N[C@H](C(=O)N1C[C@H](C[C@H]1C(=O)N[C@@H]1CCCc2ccccc12)NC(=O)Nc1ccc2C[C@H](N(Cc2c1)C(=O)[C@@H](NC(=O)[C@H](C)NC)C(C)(C)C)C(=O)N[C@@H]1CCCc2ccccc12)C(C)(C)C
InChI Key: InChIKey=HEUQZEJFJZTMAR-JSNDJGPMSA-N
Data: 1 IC50
Activity Spreadsheet -- Enzyme Inhibition Constant Data from BindingDB
Found 1 hit for monomerid = 50071863
Trg + Lig
Ki
nM
ΔG°
kcal/mole
IC50
nM
Kd
nM
EC50/IC50
nM
koff
s-1
kon
M-1s-1
pHTemp
°C
Baculoviral IAP repeat-containing protein 2
(Homo sapiens (Human))
BDBM50071863
(CHEMBL3410874)
Show SMILES CN[C@@H](C)C(=O)N[C@H](C(=O)N1C[C@H](C[C@H]1C(=O)N[C@@H]1CCCc2ccccc12)NC(=O)Nc1ccc2C[C@H](N(Cc2c1)C(=O)[C@@H](NC(=O)[C@H](C)NC)C(C)(C)C)C(=O)N[C@@H]1CCCc2ccccc12)C(C)(C)C |r|
Show InChI InChI=1S/C56H78N10O7/c1-32(57-9)48(67)63-46(55(3,4)5)52(71)65-30-37-27-38(26-25-36(37)28-44(65)50(69)61-42-23-15-19-34-17-11-13-21-40(34)42)59-54(73)60-39-29-45(51(70)62-43-24-16-20-35-18-12-14-22-41(35)43)66(31-39)53(72)47(56(6,7)8)64-49(68)33(2)58-10/h11-14,17-18,21-22,25-27,32-33,39,42-47,57-58H,15-16,19-20,23-24,28-31H2,1-10H3,(H,61,69)(H,62,70)(H,63,67)(H,64,68)(H2,59,60,73)/t32-,33-,39-,42+,43+,44-,45-,46+,47+/m0/s1
n/an/a 5.60n/an/an/an/an/an/a
Bristol-Myers Squibb Research
Curated by ChEMBL
Assay Description
Binding affinity to human N-terminal His-tagged cIAP1 BIR2-3 C202A/C213G mutant after 60 mins by HTRF assay
J Med Chem 58: 1556-62 (2015)
Article DOI: 10.1021/jm501482t
BindingDB Entry DOI: 10.7270/Q2N29ZM8