BDBM50071993 6,9-Difluoro-1,3,3-trimethyl-4,11-dihydro-3H-indeno[2,1-f]quinoline::CHEMBL431280
SMILES: CC1=CC(C)(C)Nc2cc(F)c-3c(Cc4cc(F)ccc-34)c12
InChI Key: InChIKey=YQCQOEFFZHSJQQ-UHFFFAOYSA-N
Data: 2 KI  1 IC50
Activity Spreadsheet -- Enzyme Inhibition Constant Data from BindingDB
Found 3 hits for monomerid = 50071993
Trg + Lig
Ki
nM
ΔG°
kcal/mole
IC50
nM
Kd
nM
EC50/IC50
nM
koff
s-1
kon
M-1s-1
pHTemp
°C
Progesterone receptor
(Homo sapiens (Human))
BDBM50071993
(6,9-Difluoro-1,3,3-trimethyl-4,11-dihydro-3H-inden...)
Show SMILES CC1=CC(C)(C)Nc2cc(F)c-3c(Cc4cc(F)ccc-34)c12 |t:1|
Show InChI InChI=1S/C19H17F2N/c1-10-9-19(2,3)22-16-8-15(21)18-13-5-4-12(20)6-11(13)7-14(18)17(10)16/h4-6,8-9,22H,7H2,1-3H3
21n/an/an/an/an/an/an/an/a
Ligand Pharmaceuticals
Curated by ChEMBL
Assay Description
Binding affinity against human progesterone receptor-A (hPR-A)
Bioorg Med Chem Lett 8: 2731-6 (1999)
BindingDB Entry DOI: 10.7270/Q2QF8S1M
Progesterone receptor
(Homo sapiens (Human))
BDBM50071993
(6,9-Difluoro-1,3,3-trimethyl-4,11-dihydro-3H-inden...)
Show SMILES CC1=CC(C)(C)Nc2cc(F)c-3c(Cc4cc(F)ccc-34)c12 |t:1|
Show InChI InChI=1S/C19H17F2N/c1-10-9-19(2,3)22-16-8-15(21)18-13-5-4-12(20)6-11(13)7-14(18)17(10)16/h4-6,8-9,22H,7H2,1-3H3
21n/an/an/an/an/an/an/an/a
Scientific Computing Ltd.
Curated by ChEMBL
Assay Description
Displacement of [3H]progesterone from Progesterone receptor
J Med Chem 49: 4261-8 (2006)
Article DOI: 10.1021/jm060234e
BindingDB Entry DOI: 10.7270/Q2V69NB6
Progesterone receptor
(Homo sapiens (Human))
BDBM50071993
(6,9-Difluoro-1,3,3-trimethyl-4,11-dihydro-3H-inden...)
Show SMILES CC1=CC(C)(C)Nc2cc(F)c-3c(Cc4cc(F)ccc-34)c12 |t:1|
Show InChI InChI=1S/C19H17F2N/c1-10-9-19(2,3)22-16-8-15(21)18-13-5-4-12(20)6-11(13)7-14(18)17(10)16/h4-6,8-9,22H,7H2,1-3H3
n/an/a 5.69E+3n/an/an/an/an/an/a
Ligand Pharmaceuticals
Curated by ChEMBL
Assay Description
Binding affinity against human progesterone receptor-A (hPR-A)
Bioorg Med Chem Lett 8: 2731-6 (1999)
BindingDB Entry DOI: 10.7270/Q2QF8S1M