BDBM50071994 8-Bromo-2,2,4-trimethyl-2,10-dihydro-1H-indeno[1,2-g]quinolin-10-ol::CHEMBL91708
SMILES: CC1=CC(C)(C)Nc2cc3C(O)c4cc(Br)ccc4-c3cc12
InChI Key: InChIKey=KJDBORWRPHJLDO-UHFFFAOYSA-N
Data: 1 KI  1 IC50
Activity Spreadsheet -- Enzyme Inhibition Constant Data from BindingDB
Found 2 hits for monomerid = 50071994
Trg + Lig
Ki
nM
ΔG°
kcal/mole
IC50
nM
Kd
nM
EC50/IC50
nM
koff
s-1
kon
M-1s-1
pHTemp
°C
Progesterone receptor
(Homo sapiens (Human))
BDBM50071994
(8-Bromo-2,2,4-trimethyl-2,10-dihydro-1H-indeno[1,2...)
Show SMILES CC1=CC(C)(C)Nc2cc3C(O)c4cc(Br)ccc4-c3cc12 |t:1|
Show InChI InChI=1S/C19H18BrNO/c1-10-9-19(2,3)21-17-8-16-14(7-13(10)17)12-5-4-11(20)6-15(12)18(16)22/h4-9,18,21-22H,1-3H3
1.86E+3n/an/an/an/an/an/an/an/a
Ligand Pharmaceuticals
Curated by ChEMBL
Assay Description
Antagonist activity against human progesterone receptor B (hPR-B) in cotransfected CV-1 cells
Bioorg Med Chem Lett 8: 2731-6 (1999)
BindingDB Entry DOI: 10.7270/Q2QF8S1M
Progesterone receptor
(Homo sapiens (Human))
BDBM50071994
(8-Bromo-2,2,4-trimethyl-2,10-dihydro-1H-indeno[1,2...)
Show SMILES CC1=CC(C)(C)Nc2cc3C(O)c4cc(Br)ccc4-c3cc12 |t:1|
Show InChI InChI=1S/C19H18BrNO/c1-10-9-19(2,3)21-17-8-16-14(7-13(10)17)12-5-4-11(20)6-15(12)18(16)22/h4-9,18,21-22H,1-3H3
n/an/a 3.44E+3n/an/an/an/an/an/a
Ligand Pharmaceuticals
Curated by ChEMBL
Assay Description
Antagonist activity against human progesterone receptor B (hPR-B) in cotransfected CV-1 cells
Bioorg Med Chem Lett 8: 2731-6 (1999)
BindingDB Entry DOI: 10.7270/Q2QF8S1M