BDBM50072007 9-Fluoro-2,2,4-trimethyl-2,10-dihydro-1H-indeno[1,2-g]quinoline::CHEMBL93690
SMILES: CC1=CC(C)(C)Nc2cc3Cc4c(cccc4F)-c3cc12
InChI Key: InChIKey=HABVEGMNVSOGOR-UHFFFAOYSA-N
Data: 2 KI  1 IC50
Activity Spreadsheet -- Enzyme Inhibition Constant Data from BindingDB
Found 3 hits for monomerid = 50072007
Trg + Lig
Ki
nM
ΔG°
kcal/mole
IC50
nM
Kd
nM
EC50/IC50
nM
koff
s-1
kon
M-1s-1
pHTemp
°C
Progesterone receptor
(Homo sapiens (Human))
BDBM50072007
(9-Fluoro-2,2,4-trimethyl-2,10-dihydro-1H-indeno[1,...)
Show SMILES CC1=CC(C)(C)Nc2cc3Cc4c(cccc4F)-c3cc12 |t:1|
Show InChI InChI=1S/C19H18FN/c1-11-10-19(2,3)21-18-8-12-7-16-13(5-4-6-17(16)20)15(12)9-14(11)18/h4-6,8-10,21H,7H2,1-3H3
2.30n/an/an/an/an/an/an/an/a
Ligand Pharmaceuticals
Curated by ChEMBL
Assay Description
Binding affinity against human progesterone receptor-A (hPR-A)
Bioorg Med Chem Lett 8: 2731-6 (1999)
BindingDB Entry DOI: 10.7270/Q2QF8S1M
Progesterone receptor
(Homo sapiens (Human))
BDBM50072007
(9-Fluoro-2,2,4-trimethyl-2,10-dihydro-1H-indeno[1,...)
Show SMILES CC1=CC(C)(C)Nc2cc3Cc4c(cccc4F)-c3cc12 |t:1|
Show InChI InChI=1S/C19H18FN/c1-11-10-19(2,3)21-18-8-12-7-16-13(5-4-6-17(16)20)15(12)9-14(11)18/h4-6,8-10,21H,7H2,1-3H3
2.30n/an/an/an/an/an/an/an/a
Scientific Computing Ltd.
Curated by ChEMBL
Assay Description
Displacement of [3H]progesterone from Progesterone receptor
J Med Chem 49: 4261-8 (2006)
Article DOI: 10.1021/jm060234e
BindingDB Entry DOI: 10.7270/Q2V69NB6
Progesterone receptor
(Homo sapiens (Human))
BDBM50072007
(9-Fluoro-2,2,4-trimethyl-2,10-dihydro-1H-indeno[1,...)
Show SMILES CC1=CC(C)(C)Nc2cc3Cc4c(cccc4F)-c3cc12 |t:1|
Show InChI InChI=1S/C19H18FN/c1-11-10-19(2,3)21-18-8-12-7-16-13(5-4-6-17(16)20)15(12)9-14(11)18/h4-6,8-10,21H,7H2,1-3H3
n/an/a 1.77E+3n/an/an/an/an/an/a
Ligand Pharmaceuticals
Curated by ChEMBL
Assay Description
Antagonist activity against human progesterone receptor B (hPR-B) in cotransfected CV-1 cells
Bioorg Med Chem Lett 8: 2731-6 (1999)
BindingDB Entry DOI: 10.7270/Q2QF8S1M