BDBM50072050 CHEMBL92407::{(S)-1-[(S)-1-((S)-2-Hydroxy-5-oxo-tetrahydro-furan-3-ylcarbamoyl)-ethyl]-2-oxo-pyrrolidin-3-yl}-carbamic acid benzyl ester
SMILES: C[C@H](N1CC[C@H](NC(=O)OCc2ccccc2)C1=O)C(=O)N[C@H]1CC(=O)OC1O
InChI Key: InChIKey=WTUBVGCACKUUOI-HEACJYEFSA-N
Data: 2 IC50
Activity Spreadsheet -- Enzyme Inhibition Constant Data from BindingDB
Found 2 hits for monomerid = 50072050
Trg + Lig
Ki
nM
ΔG°
kcal/mole
IC50
nM
Kd
nM
EC50/IC50
nM
koff
s-1
kon
M-1s-1
pHTemp
°C
Caspase-1
(Mus musculus)
BDBM50072050
(CHEMBL92407 | {(S)-1-[(S)-1-((S)-2-Hydroxy-5-oxo-t...)
Show SMILES C[C@H](N1CC[C@H](NC(=O)OCc2ccccc2)C1=O)C(=O)N[C@H]1CC(=O)OC1O
Show InChI InChI=1S/C19H23N3O7/c1-11(16(24)20-14-9-15(23)29-18(14)26)22-8-7-13(17(22)25)21-19(27)28-10-12-5-3-2-4-6-12/h2-6,11,13-14,18,26H,7-10H2,1H3,(H,20,24)(H,21,27)/t11-,13-,14-,18?/m0/s1
Reactome pathway
n/an/a 3.70E+3n/an/an/an/an/an/a
Idun Pharmaceuticals
Curated by ChEMBL
Assay Description
Inhibitory activity against Caspase-1 using Ac-TyrValAlaAsp-amc as substrate
Bioorg Med Chem Lett 8: 2757-62 (1999)
BindingDB Entry DOI: 10.7270/Q2KP8198
Caspase-3
(Homo sapiens (Human))
BDBM50072050
(CHEMBL92407 | {(S)-1-[(S)-1-((S)-2-Hydroxy-5-oxo-t...)
Show SMILES C[C@H](N1CC[C@H](NC(=O)OCc2ccccc2)C1=O)C(=O)N[C@H]1CC(=O)OC1O
Show InChI InChI=1S/C19H23N3O7/c1-11(16(24)20-14-9-15(23)29-18(14)26)22-8-7-13(17(22)25)21-19(27)28-10-12-5-3-2-4-6-12/h2-6,11,13-14,18,26H,7-10H2,1H3,(H,20,24)(H,21,27)/t11-,13-,14-,18?/m0/s1
NCI pathway
Reactome pathway
n/an/a>1.00E+5n/an/an/an/an/an/a
Idun Pharmaceuticals
Curated by ChEMBL
Assay Description
Inhibitory activity against human Caspase-3 using Ac-AspGluValAsp as substrate
Bioorg Med Chem Lett 8: 2757-62 (1999)
BindingDB Entry DOI: 10.7270/Q2KP8198