BDBM50072071 CHEMBL3407855
SMILES: Cc1nc2cc(ccc2s1)-c1c(C)ccc(C(=O)c2c(-c3ccccc3)n(C)n(-c3ccccc3)c2=O)c1N
InChI Key: InChIKey=FMKSPJHSPNIVAS-UHFFFAOYSA-N
Data: 4 IC50  1 EC50
Activity Spreadsheet -- Enzyme Inhibition Constant Data from BindingDB
Found 5 hits for monomerid = 50072071
Trg + Lig
Ki
nM
ΔG°
kcal/mole
IC50
nM
Kd
nM
EC50/IC50
nM
koff
s-1
kon
M-1s-1
pHTemp
°C
Eukaryotic translation initiation factor 2-alpha kinase 3
(Homo sapiens (Human))
BDBM50072071
(CHEMBL3407855)
Show SMILES Cc1nc2cc(ccc2s1)-c1c(C)ccc(C(=O)c2c(-c3ccccc3)n(C)n(-c3ccccc3)c2=O)c1N
Show InChI InChI=1S/C32H26N4O2S/c1-19-14-16-24(29(33)27(19)22-15-17-26-25(18-22)34-20(2)39-26)31(37)28-30(21-10-6-4-7-11-21)35(3)36(32(28)38)23-12-8-5-9-13-23/h4-18H,33H2,1-3H3
n/an/a 240n/an/an/an/an/an/a
Amgen Inc.
Curated by ChEMBL
Assay Description
Inhibition of human N-terminal His-tagged PERK expressed in Escherichia coli using AviTag C-terminal, N-terminal His-tagged eIF2alpha (3 to 315) as s...
J Med Chem 58: 1426-41 (2015)
Article DOI: 10.1021/jm5017494
BindingDB Entry DOI: 10.7270/Q27W6DWN
eIF-2-alpha kinase GCN2
(Homo sapiens (Human))
BDBM50072071
(CHEMBL3407855)
Show SMILES Cc1nc2cc(ccc2s1)-c1c(C)ccc(C(=O)c2c(-c3ccccc3)n(C)n(-c3ccccc3)c2=O)c1N
Show InChI InChI=1S/C32H26N4O2S/c1-19-14-16-24(29(33)27(19)22-15-17-26-25(18-22)34-20(2)39-26)31(37)28-30(21-10-6-4-7-11-21)35(3)36(32(28)38)23-12-8-5-9-13-23/h4-18H,33H2,1-3H3
n/an/a>1.00E+4n/an/an/an/an/an/a
Amgen Inc.
Curated by ChEMBL
Assay Description
Inhibition of human C-terminal His-tagged GCN2 expressed in Escherichia coli using AviTag C-terminal, N-terminal His-tagged eIF2alpha (3 to 315) as s...
J Med Chem 58: 1426-41 (2015)
Article DOI: 10.1021/jm5017494
BindingDB Entry DOI: 10.7270/Q27W6DWN
Eukaryotic translation initiation factor 2-alpha kinase 3
(Homo sapiens (Human))
BDBM50072071
(CHEMBL3407855)
Show SMILES Cc1nc2cc(ccc2s1)-c1c(C)ccc(C(=O)c2c(-c3ccccc3)n(C)n(-c3ccccc3)c2=O)c1N
Show InChI InChI=1S/C32H26N4O2S/c1-19-14-16-24(29(33)27(19)22-15-17-26-25(18-22)34-20(2)39-26)31(37)28-30(21-10-6-4-7-11-21)35(3)36(32(28)38)23-12-8-5-9-13-23/h4-18H,33H2,1-3H3
n/an/an/an/a 5.60E+3n/an/an/an/a
Amgen Inc.
Curated by ChEMBL
Assay Description
Inhibition of PERK-mediated protein synthesis in human U2OS cells harboring thapsigargin-induced ER stress assessed as incorporation of L-azidohomoal...
J Med Chem 58: 1426-41 (2015)
Article DOI: 10.1021/jm5017494
BindingDB Entry DOI: 10.7270/Q27W6DWN
Eukaryotic translation initiation factor 2-alpha kinase 3
(Homo sapiens (Human))
BDBM50072071
(CHEMBL3407855)
Show SMILES Cc1nc2cc(ccc2s1)-c1c(C)ccc(C(=O)c2c(-c3ccccc3)n(C)n(-c3ccccc3)c2=O)c1N
Show InChI InChI=1S/C32H26N4O2S/c1-19-14-16-24(29(33)27(19)22-15-17-26-25(18-22)34-20(2)39-26)31(37)28-30(21-10-6-4-7-11-21)35(3)36(32(28)38)23-12-8-5-9-13-23/h4-18H,33H2,1-3H3
n/an/a>1.00E+4n/an/an/an/an/an/a
Amgen Inc.
Curated by ChEMBL
Assay Description
Inhibition of doxycycline-inducible T-REx-PERK-FLAG (unknown origin) autophosphorylation tranfected in human HT1080 cells after 1 hr by sandwich ELIS...
J Med Chem 58: 1426-41 (2015)
Article DOI: 10.1021/jm5017494
BindingDB Entry DOI: 10.7270/Q27W6DWN
Serine/threonine-protein kinase B-raf
(Homo sapiens (Human))
BDBM50072071
(CHEMBL3407855)
Show SMILES Cc1nc2cc(ccc2s1)-c1c(C)ccc(C(=O)c2c(-c3ccccc3)n(C)n(-c3ccccc3)c2=O)c1N
Show InChI InChI=1S/C32H26N4O2S/c1-19-14-16-24(29(33)27(19)22-15-17-26-25(18-22)34-20(2)39-26)31(37)28-30(21-10-6-4-7-11-21)35(3)36(32(28)38)23-12-8-5-9-13-23/h4-18H,33H2,1-3H3
NCI pathway
Reactome pathway
n/an/a>1.00E+3n/an/an/an/an/an/a
Amgen Inc.
Curated by ChEMBL
Assay Description
Inhibition of recombinant BRAF V600E kinase domain mutant (unknown origin)
J Med Chem 58: 1426-41 (2015)
Article DOI: 10.1021/jm5017494
BindingDB Entry DOI: 10.7270/Q27W6DWN