null
SMILES: COc1ccc(cc1OC)S(=O)(=O)Nc1ncc(s1)-c1cccc(c1)[N+]([O-])=O
InChI Key: InChIKey=OTMNCEWWUNZMED-UHFFFAOYSA-N
Activity Spreadsheet -- Enzyme Inhibition Constant Data from BindingDB
Found 2 hits for monomerid = 50072084
Trg + Lig
Ki
nM
ΔG°
kcal/mole
IC50
nM
Kd
nM
EC50/IC50
nM
koff
s-1
kon
M-1s-1
pHTemp
°C
Kynurenine 3-monooxygenase
(Homo sapiens (Human))
BDBM50072084
(CHEMBL3407930)
Show SMILES COc1ccc(cc1OC)S(=O)(=O)Nc1ncc(s1)-c1cccc(c1)[N+]([O-])=O
Show InChI InChI=1S/C17H15N3O6S2/c1-25-14-7-6-13(9-15(14)26-2)28(23,24)19-17-18-10-16(27-17)11-4-3-5-12(8-11)20(21)22/h3-10H,1-2H3,(H,18,19)
Reactome pathway
n/an/a 34n/an/an/an/an/an/a
TBA
Citation and Details
Kynurenine 3-monooxygenase
(Homo sapiens (Human))
BDBM50072084
(CHEMBL3407930)
Show SMILES COc1ccc(cc1OC)S(=O)(=O)Nc1ncc(s1)-c1cccc(c1)[N+]([O-])=O
Show InChI InChI=1S/C17H15N3O6S2/c1-25-14-7-6-13(9-15(14)26-2)28(23,24)19-17-18-10-16(27-17)11-4-3-5-12(8-11)20(21)22/h3-10H,1-2H3,(H,18,19)
Reactome pathway
n/an/a 37n/an/an/an/an/an/a
Evotec (U.K.) Ltd
Curated by ChEMBL
Assay Description
Inhibition of KMO (unknown origin)
J Med Chem 58: 1159-83 (2015)
Article DOI: 10.1021/jm501350y
BindingDB Entry DOI: 10.7270/Q2445P5N