BDBM50072090 CHEMBL3407872
SMILES: OC(=O)c1cc(Nc2ccc(Cl)c(Cl)c2)ncn1
InChI Key: InChIKey=PMHJFSHNGBPIEP-UHFFFAOYSA-N
Data: 2 IC50
Activity Spreadsheet -- Enzyme Inhibition Constant Data from BindingDB
Found 2 hits for monomerid = 50072090
Trg + Lig
Ki
nM
ΔG°
kcal/mole
IC50
nM
Kd
nM
EC50/IC50
nM
koff
s-1
kon
M-1s-1
pHTemp
°C
Kynurenine 3-monooxygenase
(Homo sapiens (Human))
BDBM50072090
(CHEMBL3407872)
Show SMILES OC(=O)c1cc(Nc2ccc(Cl)c(Cl)c2)ncn1
Show InChI InChI=1S/C11H7Cl2N3O2/c12-7-2-1-6(3-8(7)13)16-10-4-9(11(17)18)14-5-15-10/h1-5H,(H,17,18)(H,14,15,16)
Reactome pathway
n/an/a>1.00E+4n/an/an/an/an/an/a
Evotec (U.K.) Ltd
Curated by ChEMBL
Assay Description
Inhibition of human KMO transfected in CHO cells assessed as conversion of kynurenine to 3-hydroxykynurenine by LC-MS/MS analysis
J Med Chem 58: 1159-83 (2015)
Article DOI: 10.1021/jm501350y
BindingDB Entry DOI: 10.7270/Q2445P5N
Kynurenine 3-monooxygenase
(Homo sapiens (Human))
BDBM50072090
(CHEMBL3407872)
Show SMILES OC(=O)c1cc(Nc2ccc(Cl)c(Cl)c2)ncn1
Show InChI InChI=1S/C11H7Cl2N3O2/c12-7-2-1-6(3-8(7)13)16-10-4-9(11(17)18)14-5-15-10/h1-5H,(H,17,18)(H,14,15,16)
Reactome pathway
n/an/a 9.50E+3n/an/an/an/an/an/a
Evotec (U.K.) Ltd
Curated by ChEMBL
Assay Description
Inhibition of human KMO assessed as conversion of kynurenine to 3-hydroxykynurenine by LC-MS/MS analysis
J Med Chem 58: 1159-83 (2015)
Article DOI: 10.1021/jm501350y
BindingDB Entry DOI: 10.7270/Q2445P5N