BDBM50072123 CHEMBL3407904
SMILES: OC(=O)c1cc(ncn1)-c1cccc(Cl)c1F
InChI Key: InChIKey=IZZVCQGMXWJWJN-UHFFFAOYSA-N
Data: 2 IC50
Activity Spreadsheet -- Enzyme Inhibition Constant Data from BindingDB
Found 2 hits for monomerid = 50072123
Trg + Lig
Ki
nM
ΔG°
kcal/mole
IC50
nM
Kd
nM
EC50/IC50
nM
koff
s-1
kon
M-1s-1
pHTemp
°C
Kynurenine 3-monooxygenase
(Homo sapiens (Human))
BDBM50072123
(CHEMBL3407904)
Show SMILES OC(=O)c1cc(ncn1)-c1cccc(Cl)c1F
Show InChI InChI=1S/C11H6ClFN2O2/c12-7-3-1-2-6(10(7)13)8-4-9(11(16)17)15-5-14-8/h1-5H,(H,16,17)
Reactome pathway
n/an/a 310n/an/an/an/an/an/a
Evotec (U.K.) Ltd
Curated by ChEMBL
Assay Description
Inhibition of human KMO transfected in CHO cells assessed as conversion of kynurenine to 3-hydroxykynurenine by LC-MS/MS analysis
J Med Chem 58: 1159-83 (2015)
Article DOI: 10.1021/jm501350y
BindingDB Entry DOI: 10.7270/Q2445P5N
Kynurenine 3-monooxygenase
(Homo sapiens (Human))
BDBM50072123
(CHEMBL3407904)
Show SMILES OC(=O)c1cc(ncn1)-c1cccc(Cl)c1F
Show InChI InChI=1S/C11H6ClFN2O2/c12-7-3-1-2-6(10(7)13)8-4-9(11(16)17)15-5-14-8/h1-5H,(H,16,17)
Reactome pathway
n/an/a 0.200n/an/an/an/an/an/a
Evotec (U.K.) Ltd
Curated by ChEMBL
Assay Description
Inhibition of human KMO assessed as conversion of kynurenine to 3-hydroxykynurenine by LC-MS/MS analysis
J Med Chem 58: 1159-83 (2015)
Article DOI: 10.1021/jm501350y
BindingDB Entry DOI: 10.7270/Q2445P5N