null
SMILES: Nc1[nH]c(Sc2ccc3ccccc3c2)c(C#N)c1C#N
InChI Key: InChIKey=NUEJMJIJOXPIPG-UHFFFAOYSA-N
Activity Spreadsheet -- Enzyme Inhibition Constant Data from BindingDB
Found 2 hits for monomerid = 50072144
Trg + Lig
Ki
nM
ΔG°
kcal/mole
IC50
nM
Kd
nM
EC50/IC50
nM
koff
s-1
kon
M-1s-1
pHTemp
°C
Dual specificity mitogen-activated protein kinase kinase 1
(Homo sapiens (Human))
BDBM50072144
(2-Amino-5-(naphthalen-2-ylsulfanyl)-1H-pyrrole-3,4...)
Show SMILES Nc1[nH]c(Sc2ccc3ccccc3c2)c(C#N)c1C#N
Show InChI InChI=1S/C16H10N4S/c17-8-13-14(9-18)16(20-15(13)19)21-12-6-5-10-3-1-2-4-11(10)7-12/h1-7,20H,19H2
Reactome pathway
n/an/a 1.40E+3n/an/an/an/an/an/a
DuPont Pharmaceuticals Company
Curated by ChEMBL
Assay Description
Non-competitive inhibition of the dual specificity kinase MEK
Bioorg Med Chem Lett 8: 2839-44 (1999)
BindingDB Entry DOI: 10.7270/Q2MW2HNN
Dual specificity mitogen-activated protein kinase kinase 1/2
(Homo sapiens (Human))
BDBM50072144
(2-Amino-5-(naphthalen-2-ylsulfanyl)-1H-pyrrole-3,4...)
Show SMILES Nc1[nH]c(Sc2ccc3ccccc3c2)c(C#N)c1C#N
Show InChI InChI=1S/C16H10N4S/c17-8-13-14(9-18)16(20-15(13)19)21-12-6-5-10-3-1-2-4-11(10)7-12/h1-7,20H,19H2
n/an/a 2.51E+4n/an/an/an/an/an/a
DuPont Pharmaceuticals Company
Curated by ChEMBL
Assay Description
Ability to antagonise AP-1 transcriptional activity
Bioorg Med Chem Lett 8: 2839-44 (1999)
BindingDB Entry DOI: 10.7270/Q2MW2HNN