BDBM50072171 (1S,2S,3S)-2-[1-Amino-1-carboxy-2-(9H-xanthen-9-yl)-ethyl]-3-methyl-cyclopropanecarboxylic acid::CHEMBL97574
SMILES: C[C@@H]1[C@@H]([C@H]1C(N)(CC1c2ccccc2Oc2ccccc12)C(O)=O)C(O)=O
InChI Key: InChIKey=VYTOVCNIMJIGDL-FPNSYFSOSA-N
Data: 6 IC50
Activity Spreadsheet -- Enzyme Inhibition Constant Data from BindingDB
Found 6 hits for monomerid = 50072171
Trg + Lig
Ki
nM
ΔG°
kcal/mole
IC50
nM
Kd
nM
EC50/IC50
nM
koff
s-1
kon
M-1s-1
pHTemp
°C
Metabotropic glutamate receptor 1
(Homo sapiens (Human))
BDBM50072171
((1S,2S,3S)-2-[1-Amino-1-carboxy-2-(9H-xanthen-9-yl...)
Show SMILES C[C@@H]1[C@@H]([C@H]1C(N)(CC1c2ccccc2Oc2ccccc12)C(O)=O)C(O)=O
Show InChI InChI=1S/C21H21NO5/c1-11-17(19(23)24)18(11)21(22,20(25)26)10-14-12-6-2-4-8-15(12)27-16-9-5-3-7-13(14)16/h2-9,11,14,17-18H,10,22H2,1H3,(H,23,24)(H,25,26)/t11-,17+,18+,21?/m1/s1
n/an/a>1.00E+5n/an/an/an/an/an/a
Centro de Investigación Lilly, SA
Curated by ChEMBL
Assay Description
Antagonistic activity against metabotropic glutamate receptor 1 (mGluR1) was evaluated
Bioorg Med Chem Lett 8: 2849-54 (1999)
BindingDB Entry DOI: 10.7270/Q2Z0379C
Metabotropic glutamate receptor 4 (mGluR4)
(Homo sapiens (Human))
BDBM50072171
((1S,2S,3S)-2-[1-Amino-1-carboxy-2-(9H-xanthen-9-yl...)
Show SMILES C[C@@H]1[C@@H]([C@H]1C(N)(CC1c2ccccc2Oc2ccccc12)C(O)=O)C(O)=O
Show InChI InChI=1S/C21H21NO5/c1-11-17(19(23)24)18(11)21(22,20(25)26)10-14-12-6-2-4-8-15(12)27-16-9-5-3-7-13(14)16/h2-9,11,14,17-18H,10,22H2,1H3,(H,23,24)(H,25,26)/t11-,17+,18+,21?/m1/s1
n/an/a 6.29E+4n/an/an/an/an/an/a
Centro de Investigación Lilly, SA
Curated by ChEMBL
Assay Description
Antagonistic activity against metabotropic glutamate receptor 4 (mGluR4) was evaluated
Bioorg Med Chem Lett 8: 2849-54 (1999)
BindingDB Entry DOI: 10.7270/Q2Z0379C
Metabotropic glutamate receptor 5
(Homo sapiens (Human))
BDBM50072171
((1S,2S,3S)-2-[1-Amino-1-carboxy-2-(9H-xanthen-9-yl...)
Show SMILES C[C@@H]1[C@@H]([C@H]1C(N)(CC1c2ccccc2Oc2ccccc12)C(O)=O)C(O)=O
Show InChI InChI=1S/C21H21NO5/c1-11-17(19(23)24)18(11)21(22,20(25)26)10-14-12-6-2-4-8-15(12)27-16-9-5-3-7-13(14)16/h2-9,11,14,17-18H,10,22H2,1H3,(H,23,24)(H,25,26)/t11-,17+,18+,21?/m1/s1
n/an/a>1.00E+5n/an/an/an/an/an/a
Centro de Investigación Lilly, SA
Curated by ChEMBL
Assay Description
Antagonistic activity against metabotropic glutamate receptor 5 (mGluR5) was evaluated
Bioorg Med Chem Lett 8: 2849-54 (1999)
BindingDB Entry DOI: 10.7270/Q2Z0379C
GRM8
(Homo sapiens (Human))
BDBM50072171
((1S,2S,3S)-2-[1-Amino-1-carboxy-2-(9H-xanthen-9-yl...)
Show SMILES C[C@@H]1[C@@H]([C@H]1C(N)(CC1c2ccccc2Oc2ccccc12)C(O)=O)C(O)=O
Show InChI InChI=1S/C21H21NO5/c1-11-17(19(23)24)18(11)21(22,20(25)26)10-14-12-6-2-4-8-15(12)27-16-9-5-3-7-13(14)16/h2-9,11,14,17-18H,10,22H2,1H3,(H,23,24)(H,25,26)/t11-,17+,18+,21?/m1/s1
n/an/a 1.23E+3n/an/an/an/an/an/a
Centro de Investigación Lilly, SA
Curated by ChEMBL
Assay Description
Antagonistic activity against metabotropic glutamate receptor 8 (mGluR8) was evaluated
Bioorg Med Chem Lett 8: 2849-54 (1999)
BindingDB Entry DOI: 10.7270/Q2Z0379C
Metabotropic glutamate receptor 3
(Rattus norvegicus (Rat))
BDBM50072171
((1S,2S,3S)-2-[1-Amino-1-carboxy-2-(9H-xanthen-9-yl...)
Show SMILES C[C@@H]1[C@@H]([C@H]1C(N)(CC1c2ccccc2Oc2ccccc12)C(O)=O)C(O)=O
Show InChI InChI=1S/C21H21NO5/c1-11-17(19(23)24)18(11)21(22,20(25)26)10-14-12-6-2-4-8-15(12)27-16-9-5-3-7-13(14)16/h2-9,11,14,17-18H,10,22H2,1H3,(H,23,24)(H,25,26)/t11-,17+,18+,21?/m1/s1
n/an/a 1.00E+3n/an/an/an/an/an/a
Centro de Investigación Lilly, SA
Curated by ChEMBL
Assay Description
Antagonistic activity against metabotropic glutamate receptor 3 (mGluR3) was evaluated
Bioorg Med Chem Lett 8: 2849-54 (1999)
BindingDB Entry DOI: 10.7270/Q2Z0379C
GRM7
(Homo sapiens (Human))
BDBM50072171
((1S,2S,3S)-2-[1-Amino-1-carboxy-2-(9H-xanthen-9-yl...)
Show SMILES C[C@@H]1[C@@H]([C@H]1C(N)(CC1c2ccccc2Oc2ccccc12)C(O)=O)C(O)=O
Show InChI InChI=1S/C21H21NO5/c1-11-17(19(23)24)18(11)21(22,20(25)26)10-14-12-6-2-4-8-15(12)27-16-9-5-3-7-13(14)16/h2-9,11,14,17-18H,10,22H2,1H3,(H,23,24)(H,25,26)/t11-,17+,18+,21?/m1/s1
n/an/a 2.31E+4n/an/an/an/an/an/a
Centro de Investigación Lilly, SA
Curated by ChEMBL
Assay Description
Antagonistic activity against metabotropic glutamate receptor 7 (mGluR7) was evaluated
Bioorg Med Chem Lett 8: 2849-54 (1999)
BindingDB Entry DOI: 10.7270/Q2Z0379C