BDBM50072286 (3R,3aR,6aS)-3-Benzyl-hexahydro-cyclopenta[b]furan-2-one::CHEMBL102081
SMILES: O=C1O[C@H]2CCC[C@@H]2[C@H]1Cc1ccccc1
InChI Key: InChIKey=JYGJKZKLNWLLRD-UPJWGTAASA-N
Data: 3 IC50
Activity Spreadsheet -- Enzyme Inhibition Constant Data from BindingDB
Found 3 hits for monomerid = 50072286
Trg + Lig
Ki
nM
ΔG°
kcal/mole
IC50
nM
Kd
nM
EC50/IC50
nM
koff
s-1
kon
M-1s-1
pHTemp
°C
Chymotrypsin
(Homo sapiens (Human))
BDBM50072286
((3R,3aR,6aS)-3-Benzyl-hexahydro-cyclopenta[b]furan...)
Show SMILES O=C1O[C@H]2CCC[C@@H]2[C@H]1Cc1ccccc1
Show InChI InChI=1S/C14H16O2/c15-14-12(9-10-5-2-1-3-6-10)11-7-4-8-13(11)16-14/h1-3,5-6,11-13H,4,7-9H2/t11-,12-,13+/m1/s1
n/an/a>100n/an/an/an/an/an/a
GlaxoWellcome Research and Development
Curated by ChEMBL
Assay Description
Compound was evaluated for the inhibition of Chymotrypsinogen
Bioorg Med Chem Lett 8: 2955-60 (1999)
Article DOI: 10.1016/S0960-894X(98)00531-9
BindingDB Entry DOI: 10.7270/Q2JQ105F
Prothrombin
(Homo sapiens (Human))
BDBM50072286
((3R,3aR,6aS)-3-Benzyl-hexahydro-cyclopenta[b]furan...)
Show SMILES O=C1O[C@H]2CCC[C@@H]2[C@H]1Cc1ccccc1
Show InChI InChI=1S/C14H16O2/c15-14-12(9-10-5-2-1-3-6-10)11-7-4-8-13(11)16-14/h1-3,5-6,11-13H,4,7-9H2/t11-,12-,13+/m1/s1
n/an/a 92n/an/an/an/an/an/a
GlaxoWellcome Research and Development
Curated by ChEMBL
Assay Description
Inhibition of thrombin
Bioorg Med Chem Lett 8: 2955-60 (1999)
Article DOI: 10.1016/S0960-894X(98)00531-9
BindingDB Entry DOI: 10.7270/Q2JQ105F
Trypsin-1
(Homo sapiens (Human))
BDBM50072286
((3R,3aR,6aS)-3-Benzyl-hexahydro-cyclopenta[b]furan...)
Show SMILES O=C1O[C@H]2CCC[C@@H]2[C@H]1Cc1ccccc1
Show InChI InChI=1S/C14H16O2/c15-14-12(9-10-5-2-1-3-6-10)11-7-4-8-13(11)16-14/h1-3,5-6,11-13H,4,7-9H2/t11-,12-,13+/m1/s1
Reactome pathway
n/an/a 2n/an/an/an/an/an/a
GlaxoWellcome Research and Development
Curated by ChEMBL
Assay Description
Inhibition of trypsin
Bioorg Med Chem Lett 8: 2955-60 (1999)
Article DOI: 10.1016/S0960-894X(98)00531-9
BindingDB Entry DOI: 10.7270/Q2JQ105F