BDBM50072339 Benzodiazepine-Distamycin Hybrid::CHEMBL102341
SMILES: COc1cc2c(cc1OCCC(=O)Nc1cc(C(=O)Nc3cc(C(=O)Nc4cc(C(=O)NCCC(N)=N)n(C)c4)n(C)c3)n(C)c1)N=C[C@@H]1CCCN1C2=O
InChI Key: InChIKey=GJXSTSJBWPTDMU-DEOSSOPVSA-N
Data: 1 IC50
Activity Spreadsheet -- Enzyme Inhibition Constant Data from BindingDB
Found 1 hit for monomerid = 50072339
Trg + Lig
Ki
nM
ΔG°
kcal/mole
IC50
nM
Kd
nM
EC50/IC50
nM
koff
s-1
kon
M-1s-1
pHTemp
°C
GTPase HRas
(Homo sapiens (Human))
BDBM50072339
(Benzodiazepine-Distamycin Hybrid | CHEMBL102341)
Show SMILES COc1cc2c(cc1OCCC(=O)Nc1cc(C(=O)Nc3cc(C(=O)Nc4cc(C(=O)NCCC(N)=N)n(C)c4)n(C)c3)n(C)c1)N=C[C@@H]1CCCN1C2=O |c:50|
Show InChI InChI=1S/C37H43N11O7/c1-45-19-22(13-27(45)34(50)40-9-7-32(38)39)43-36(52)29-14-23(20-47(29)3)44-35(51)28-12-21(18-46(28)2)42-33(49)8-11-55-31-16-26-25(15-30(31)54-4)37(53)48-10-5-6-24(48)17-41-26/h12-20,24H,5-11H2,1-4H3,(H3,38,39)(H,40,50)(H,42,49)(H,43,52)(H,44,51)/t24-/m0/s1
n/an/a 8.00E+3n/an/an/an/an/an/a
Universit£ di Ferrara
Curated by ChEMBL
Assay Description
Inhibition of Ha-ras polymerase-chain reaction product
Bioorg Med Chem Lett 8: 3019-24 (1999)
Article DOI: 10.1016/S0960-894X(98)00544-7
BindingDB Entry DOI: 10.7270/Q2057GFM