BDBM50072473 CHEMBL110413::{(S)-7-[(5,6-Difluoro-1H-benzoimidazol-2-ylmethyl)-methyl-carbamoyl]-4-methyl-3-oxo-2,3,4,5-tetrahydro-1H-benzo[e][1,4]diazepin-2-yl}-acetic acid
SMILES: CN(Cc1nc2cc(F)c(F)cc2[nH]1)C(=O)c1ccc2N[C@@H](CC(O)=O)C(=O)N(C)Cc2c1
InChI Key: InChIKey=RZMDOCONQPJDQB-SFHVURJKSA-N
Data: 1 KI  1 IC50
Activity Spreadsheet -- Enzyme Inhibition Constant Data from BindingDB
Found 2 hits for monomerid = 50072473
Trg + Lig
Ki
nM
ΔG°
kcal/mole
IC50
nM
Kd
nM
EC50/IC50
nM
koff
s-1
kon
M-1s-1
pHTemp
°C
ITGAV/ITGB3
(Homo sapiens (Human))
BDBM50072473
(CHEMBL110413 | {(S)-7-[(5,6-Difluoro-1H-benzoimida...)
Show SMILES CN(Cc1nc2cc(F)c(F)cc2[nH]1)C(=O)c1ccc2N[C@@H](CC(O)=O)C(=O)N(C)Cc2c1
Show InChI InChI=1S/C22H21F2N5O4/c1-28-9-12-5-11(3-4-15(12)25-18(22(28)33)8-20(30)31)21(32)29(2)10-19-26-16-6-13(23)14(24)7-17(16)27-19/h3-7,18,25H,8-10H2,1-2H3,(H,26,27)(H,30,31)/t18-/m0/s1
2.5n/an/an/an/an/an/an/an/a
SmithKline Beecham Pharmaceuticals
Curated by ChEMBL
Assay Description
Affinity for alphaIIb-beta3 receptor
Bioorg Med Chem Lett 8: 3165-70 (1999)
BindingDB Entry DOI: 10.7270/Q2NG4PSF
ITGAV/ITGB3
(Homo sapiens (Human))
BDBM50072473
(CHEMBL110413 | {(S)-7-[(5,6-Difluoro-1H-benzoimida...)
Show SMILES CN(Cc1nc2cc(F)c(F)cc2[nH]1)C(=O)c1ccc2N[C@@H](CC(O)=O)C(=O)N(C)Cc2c1
Show InChI InChI=1S/C22H21F2N5O4/c1-28-9-12-5-11(3-4-15(12)25-18(22(28)33)8-20(30)31)21(32)29(2)10-19-26-16-6-13(23)14(24)7-17(16)27-19/h3-7,18,25H,8-10H2,1-2H3,(H,26,27)(H,30,31)/t18-/m0/s1
n/an/a 540n/an/an/an/an/an/a
SmithKline Beecham Pharmaceuticals
Curated by ChEMBL
Assay Description
Binding affinity evaluated against vitronectin receptor (alphaV-beta3) receptor
Bioorg Med Chem Lett 8: 3165-70 (1999)
BindingDB Entry DOI: 10.7270/Q2NG4PSF