BDBM50072477 CHEMBL320120::{(S)-7-[(6-Cyano-1H-benzoimidazol-2-ylmethyl)-methyl-carbamoyl]-4-methyl-3-oxo-2,3,4,5-tetrahydro-1H-benzo[e][1,4]diazepin-2-yl}-acetic acid
SMILES: CN(Cc1nc2ccc(cc2[nH]1)C#N)C(=O)c1ccc2N[C@@H](CC(O)=O)C(=O)N(C)Cc2c1
InChI Key: InChIKey=NDPGOABTWKUHRI-IBGZPJMESA-N
Data: 1 KI  1 IC50
Activity Spreadsheet -- Enzyme Inhibition Constant Data from BindingDB
Found 2 hits for monomerid = 50072477
Trg + Lig
Ki
nM
ΔG°
kcal/mole
IC50
nM
Kd
nM
EC50/IC50
nM
koff
s-1
kon
M-1s-1
pHTemp
°C
ITGAV/ITGB3
(Homo sapiens (Human))
BDBM50072477
(CHEMBL320120 | {(S)-7-[(6-Cyano-1H-benzoimidazol-2...)
Show SMILES CN(Cc1nc2ccc(cc2[nH]1)C#N)C(=O)c1ccc2N[C@@H](CC(O)=O)C(=O)N(C)Cc2c1
Show InChI InChI=1S/C23H22N6O4/c1-28-11-15-8-14(4-6-16(15)25-19(23(28)33)9-21(30)31)22(32)29(2)12-20-26-17-5-3-13(10-24)7-18(17)27-20/h3-8,19,25H,9,11-12H2,1-2H3,(H,26,27)(H,30,31)/t19-/m0/s1
15n/an/an/an/an/an/an/an/a
SmithKline Beecham Pharmaceuticals
Curated by ChEMBL
Assay Description
Binding affinity evaluated against vitronectin receptor (alphaV-beta3) receptor
Bioorg Med Chem Lett 8: 3165-70 (1999)
BindingDB Entry DOI: 10.7270/Q2NG4PSF
ITGAV/ITGB3
(Homo sapiens (Human))
BDBM50072477
(CHEMBL320120 | {(S)-7-[(6-Cyano-1H-benzoimidazol-2...)
Show SMILES CN(Cc1nc2ccc(cc2[nH]1)C#N)C(=O)c1ccc2N[C@@H](CC(O)=O)C(=O)N(C)Cc2c1
Show InChI InChI=1S/C23H22N6O4/c1-28-11-15-8-14(4-6-16(15)25-19(23(28)33)9-21(30)31)22(32)29(2)12-20-26-17-5-3-13(10-24)7-18(17)27-20/h3-8,19,25H,9,11-12H2,1-2H3,(H,26,27)(H,30,31)/t19-/m0/s1
n/an/a 690n/an/an/an/an/an/a
SmithKline Beecham Pharmaceuticals
Curated by ChEMBL
Assay Description
Binding affinity evaluated against vitronectin receptor (alphaV-beta3) receptor
Bioorg Med Chem Lett 8: 3165-70 (1999)
BindingDB Entry DOI: 10.7270/Q2NG4PSF