null
SMILES: CN1Cc2cc(ccc2N[C@@H](CC(O)=O)C1=O)C(=O)N(Cc1nc2ccccc2[nH]1)Cc1nc2ccccc2[nH]1
InChI Key: InChIKey=JSOMTIGKDWXVCJ-DEOSSOPVSA-N
Activity Spreadsheet -- Enzyme Inhibition Constant Data from BindingDB
Found 2 hits for monomerid = 50072483
Trg + Lig
Ki
nM
ΔG°
kcal/mole
IC50
nM
Kd
nM
EC50/IC50
nM
koff
s-1
kon
M-1s-1
pHTemp
°C
Integrin alpha-V/beta-3
(Homo sapiens (Human))
BDBM50072483
(CHEMBL110517 | {(S)-7-[Bis-(1H-benzoimidazol-2-ylm...)
Show SMILES CN1Cc2cc(ccc2N[C@@H](CC(O)=O)C1=O)C(=O)N(Cc1nc2ccccc2[nH]1)Cc1nc2ccccc2[nH]1
Show InChI InChI=1S/C29H27N7O4/c1-35-14-18-12-17(10-11-19(18)30-24(29(35)40)13-27(37)38)28(39)36(15-25-31-20-6-2-3-7-21(20)32-25)16-26-33-22-8-4-5-9-23(22)34-26/h2-12,24,30H,13-16H2,1H3,(H,31,32)(H,33,34)(H,37,38)/t24-/m0/s1
2.5n/an/an/an/an/an/an/an/a
SmithKline Beecham Pharmaceuticals
Curated by ChEMBL
Assay Description
Effect against adhesion of HEK 293 cells transfected with human alpha-v beta-3 to vitronectin coated plates
Bioorg Med Chem Lett 8: 3165-70 (1999)
BindingDB Entry DOI: 10.7270/Q2NG4PSF
Integrin alpha-V/beta-3
(Homo sapiens (Human))
BDBM50072483
(CHEMBL110517 | {(S)-7-[Bis-(1H-benzoimidazol-2-ylm...)
Show SMILES CN1Cc2cc(ccc2N[C@@H](CC(O)=O)C1=O)C(=O)N(Cc1nc2ccccc2[nH]1)Cc1nc2ccccc2[nH]1
Show InChI InChI=1S/C29H27N7O4/c1-35-14-18-12-17(10-11-19(18)30-24(29(35)40)13-27(37)38)28(39)36(15-25-31-20-6-2-3-7-21(20)32-25)16-26-33-22-8-4-5-9-23(22)34-26/h2-12,24,30H,13-16H2,1H3,(H,31,32)(H,33,34)(H,37,38)/t24-/m0/s1
n/an/a 480n/an/an/an/an/an/a
SmithKline Beecham Pharmaceuticals
Curated by ChEMBL
Assay Description
Effect against adhesion of HEK 293 cells transfected with human alpha-v beta-3 to vitronectin coated plates
Bioorg Med Chem Lett 8: 3165-70 (1999)
BindingDB Entry DOI: 10.7270/Q2NG4PSF