BDBM50072488 CHEMBL107983::{(S)-4-(2-Benzo[1,3]dioxol-5-yl-ethyl)-7-[(1H-benzoimidazol-2-ylmethyl)-methyl-carbamoyl]-3-oxo-2,3,4,5-tetrahydro-1H-benzo[e][1,4]diazepin-2-yl}-acetic acid
SMILES: CN(Cc1nc2ccccc2[nH]1)C(=O)c1ccc2N[C@@H](CC(O)=O)C(=O)N(CCc3ccc4OCOc4c3)Cc2c1
InChI Key: InChIKey=SPPYTCHURNFCLV-DEOSSOPVSA-N
Data: 1 KI  1 IC50
Activity Spreadsheet -- Enzyme Inhibition Constant Data from BindingDB
Found 2 hits for monomerid = 50072488
Trg + Lig
Ki
nM
ΔG°
kcal/mole
IC50
nM
Kd
nM
EC50/IC50
nM
koff
s-1
kon
M-1s-1
pHTemp
°C
ITGAV/ITGB3
(Homo sapiens (Human))
BDBM50072488
(CHEMBL107983 | {(S)-4-(2-Benzo[1,3]dioxol-5-yl-eth...)
Show SMILES CN(Cc1nc2ccccc2[nH]1)C(=O)c1ccc2N[C@@H](CC(O)=O)C(=O)N(CCc3ccc4OCOc4c3)Cc2c1
Show InChI InChI=1S/C30H29N5O6/c1-34(16-27-32-22-4-2-3-5-23(22)33-27)29(38)19-7-8-21-20(13-19)15-35(30(39)24(31-21)14-28(36)37)11-10-18-6-9-25-26(12-18)41-17-40-25/h2-9,12-13,24,31H,10-11,14-17H2,1H3,(H,32,33)(H,36,37)/t24-/m0/s1
6n/an/an/an/an/an/an/an/a
SmithKline Beecham Pharmaceuticals
Curated by ChEMBL
Assay Description
Effect against adhesion of HEK 293 cells transfected with human alpha-v beta-3 to vitronectin coated plates
Bioorg Med Chem Lett 8: 3165-70 (1999)
BindingDB Entry DOI: 10.7270/Q2NG4PSF
ITGAV/ITGB3
(Homo sapiens (Human))
BDBM50072488
(CHEMBL107983 | {(S)-4-(2-Benzo[1,3]dioxol-5-yl-eth...)
Show SMILES CN(Cc1nc2ccccc2[nH]1)C(=O)c1ccc2N[C@@H](CC(O)=O)C(=O)N(CCc3ccc4OCOc4c3)Cc2c1
Show InChI InChI=1S/C30H29N5O6/c1-34(16-27-32-22-4-2-3-5-23(22)33-27)29(38)19-7-8-21-20(13-19)15-35(30(39)24(31-21)14-28(36)37)11-10-18-6-9-25-26(12-18)41-17-40-25/h2-9,12-13,24,31H,10-11,14-17H2,1H3,(H,32,33)(H,36,37)/t24-/m0/s1
n/an/a 250n/an/an/an/an/an/a
SmithKline Beecham Pharmaceuticals
Curated by ChEMBL
Assay Description
Binding affinity evaluated against vitronectin receptor (alphaV-beta3) receptor
Bioorg Med Chem Lett 8: 3165-70 (1999)
BindingDB Entry DOI: 10.7270/Q2NG4PSF