BDBM50072787 (E)-7-(4-{4-[3-(1-Cyclohexyl-ethoxy)-propylcarbamoyl]-oxazol-2-yl}-phenyl)-7-pyridin-3-yl-hept-6-enoic acid::CHEMBL150206
SMILES: CC(OCCCNC(=O)c1coc(n1)-c1ccc(cc1)C(=C/CCCCC(O)=O)\c1cccnc1)C1CCCCC1
InChI Key: InChIKey=VDSYMHSEFRKHET-VFLNYLIXSA-N
Data: 1 IC50  1 Kd
Activity Spreadsheet -- Enzyme Inhibition Constant Data from BindingDB
Found 2 hits for monomerid = 50072787
Trg + Lig
Ki
nM
ΔG°
kcal/mole
IC50
nM
Kd
nM
EC50/IC50
nM
koff
s-1
kon
M-1s-1
pHTemp
°C
Thromboxane A2 Synthase (P450 TxA2)
(Homo sapiens (Human))
BDBM50072787
((E)-7-(4-{4-[3-(1-Cyclohexyl-ethoxy)-propylcarbamo...)
Show SMILES CC(OCCCNC(=O)c1coc(n1)-c1ccc(cc1)C(=C/CCCCC(O)=O)\c1cccnc1)C1CCCCC1
Show InChI InChI=1S/C33H41N3O5/c1-24(25-10-4-2-5-11-25)40-21-9-20-35-32(39)30-23-41-33(36-30)27-17-15-26(16-18-27)29(28-12-8-19-34-22-28)13-6-3-7-14-31(37)38/h8,12-13,15-19,22-25H,2-7,9-11,14,20-21H2,1H3,(H,35,39)(H,37,38)/b29-13+
n/an/a 11.5n/an/an/an/an/an/a
Lilly Research Laboratories
Curated by ChEMBL
Assay Description
In vitro for inhibitory activity against thromboxane synthase
J Med Chem 41: 5362-74 (1999)
Article DOI: 10.1021/jm980173n
BindingDB Entry DOI: 10.7270/Q2V123Z8
Prostanoid TP receptor
(Homo sapiens (Human))
BDBM50072787
((E)-7-(4-{4-[3-(1-Cyclohexyl-ethoxy)-propylcarbamo...)
Show SMILES CC(OCCCNC(=O)c1coc(n1)-c1ccc(cc1)C(=C/CCCCC(O)=O)\c1cccnc1)C1CCCCC1
Show InChI InChI=1S/C33H41N3O5/c1-24(25-10-4-2-5-11-25)40-21-9-20-35-32(39)30-23-41-33(36-30)27-17-15-26(16-18-27)29(28-12-8-19-34-22-28)13-6-3-7-14-31(37)38/h8,12-13,15-19,22-25H,2-7,9-11,14,20-21H2,1H3,(H,35,39)(H,37,38)/b29-13+
n/an/an/a 58.2n/an/an/an/an/a
Lilly Research Laboratories
Curated by ChEMBL
Assay Description
In vitro for antagonistic activity against thromboxane synthase receptor
J Med Chem 41: 5362-74 (1999)
Article DOI: 10.1021/jm980173n
BindingDB Entry DOI: 10.7270/Q2V123Z8