BDBM50072830 CHEMBL3410038
SMILES: Cc1c[nH]c2ncnc(-c3ccc(NC(=O)N(CCO)c4cccc(F)c4)cc3)c12
InChI Key: InChIKey=BKGOFXXTVLRSBJ-UHFFFAOYSA-N
Data: 2 IC50
Activity Spreadsheet -- Enzyme Inhibition Constant Data from BindingDB
Found 2 hits for monomerid = 50072830
Trg + Lig
Ki
nM
ΔG°
kcal/mole
IC50
nM
Kd
nM
EC50/IC50
nM
koff
s-1
kon
M-1s-1
pHTemp
°C
Rho-associated protein kinase 2
(Homo sapiens (Human))
BDBM50072830
(CHEMBL3410038)
Show SMILES Cc1c[nH]c2ncnc(-c3ccc(NC(=O)N(CCO)c4cccc(F)c4)cc3)c12
Show InChI InChI=1S/C22H20FN5O2/c1-14-12-24-21-19(14)20(25-13-26-21)15-5-7-17(8-6-15)27-22(30)28(9-10-29)18-4-2-3-16(23)11-18/h2-8,11-13,29H,9-10H2,1H3,(H,27,30)(H,24,25,26)
n/an/a 1.90E+3n/an/an/an/an/an/a
Translational Research Institute
Curated by ChEMBL
Assay Description
Inhibition of human ROCK2 using KEAKEKRQEQIAKRRRLSSLRASTSKSGGSQK peptide substrate, ATP and [gamma33P]ATP
J Med Chem 58: 1846-61 (2015)
Article DOI: 10.1021/jm501680m
BindingDB Entry DOI: 10.7270/Q2K64KRC
LIM domain kinase 1
(Homo sapiens (Human))
BDBM50072830
(CHEMBL3410038)
Show SMILES Cc1c[nH]c2ncnc(-c3ccc(NC(=O)N(CCO)c4cccc(F)c4)cc3)c12
Show InChI InChI=1S/C22H20FN5O2/c1-14-12-24-21-19(14)20(25-13-26-21)15-5-7-17(8-6-15)27-22(30)28(9-10-29)18-4-2-3-16(23)11-18/h2-8,11-13,29H,9-10H2,1H3,(H,27,30)(H,24,25,26)
Reactome pathway
n/an/a 101n/an/an/an/an/an/a
Translational Research Institute
Curated by ChEMBL
Assay Description
Inhibition of human Limk1 using cofilin substrate, ATP and [gamma33P]ATP
J Med Chem 58: 1846-61 (2015)
Article DOI: 10.1021/jm501680m
BindingDB Entry DOI: 10.7270/Q2K64KRC