BDBM50073006 CHEMBL3410693
SMILES: CCOc1cccc2cc(C(=O)NC3CCCCC3)c(=O)oc12
InChI Key: InChIKey=ULSVBPAWRBQLMS-UHFFFAOYSA-N
Data: 2 EC50
Activity Spreadsheet -- Enzyme Inhibition Constant Data from BindingDB
Found 2 hits for monomerid = 50073006
Trg + Lig
Ki
nM
ΔG°
kcal/mole
IC50
nM
Kd
nM
EC50/IC50
nM
koff
s-1
kon
M-1s-1
pHTemp
°C
Cannabinoid receptor 2
(Homo sapiens (Human))
BDBM50073006
(CHEMBL3410693)
Show SMILES CCOc1cccc2cc(C(=O)NC3CCCCC3)c(=O)oc12
Show InChI InChI=1S/C18H21NO4/c1-2-22-15-10-6-7-12-11-14(18(21)23-16(12)15)17(20)19-13-8-4-3-5-9-13/h6-7,10-11,13H,2-5,8-9H2,1H3,(H,19,20)
Reactome pathway
n/an/an/an/a>1.00E+4n/an/an/an/a
Zhejiang University
Curated by ChEMBL
Assay Description
Agonist activity at CB2 receptor (unknown origin) expressed in CHO cells by calcium mobilization assay
Eur J Med Chem 93: 16-32 (2015)
Article DOI: 10.1016/j.ejmech.2015.01.054
BindingDB Entry DOI: 10.7270/Q28P626S
Cannabinoid receptor 1
(Homo sapiens (Human))
BDBM50073006
(CHEMBL3410693)
Show SMILES CCOc1cccc2cc(C(=O)NC3CCCCC3)c(=O)oc12
Show InChI InChI=1S/C18H21NO4/c1-2-22-15-10-6-7-12-11-14(18(21)23-16(12)15)17(20)19-13-8-4-3-5-9-13/h6-7,10-11,13H,2-5,8-9H2,1H3,(H,19,20)
NCI pathway
Reactome pathway
n/an/an/an/a>1.00E+4n/an/an/an/a
Zhejiang University
Curated by ChEMBL
Assay Description
Agonist activity at CB1 receptor (unknown origin) expressed in CHO cells by calcium mobilization assay
Eur J Med Chem 93: 16-32 (2015)
Article DOI: 10.1016/j.ejmech.2015.01.054
BindingDB Entry DOI: 10.7270/Q28P626S