BDBM50073141 (S)-2-[3-(4-Cyano-benzoylamino)-2,2-dimethyl-5-phenyl-pentanoylamino]-3-phenyl-propionic acid ethyl ester::CHEMBL445116
SMILES: CCOC(=O)[C@H](Cc1ccccc1)NC(=O)C(C)(C)C(CCc1ccccc1)NC(=O)c1ccc(cc1)C#N
InChI Key: InChIKey=ZFIWICASXLPGPI-MBMZGMDYSA-N
Data: 1 IC50
Activity Spreadsheet -- Enzyme Inhibition Constant Data from BindingDB
Found 1 hit for monomerid = 50073141
Trg + Lig
Ki
nM
ΔG°
kcal/mole
IC50
nM
Kd
nM
EC50/IC50
nM
koff
s-1
kon
M-1s-1
pHTemp
°C
Beta-chymotrypsin
(Bos taurus)
BDBM50073141
((S)-2-[3-(4-Cyano-benzoylamino)-2,2-dimethyl-5-phe...)
Show SMILES CCOC(=O)[C@H](Cc1ccccc1)NC(=O)C(C)(C)C(CCc1ccccc1)NC(=O)c1ccc(cc1)C#N
Show InChI InChI=1S/C32H35N3O4/c1-4-39-30(37)27(21-24-13-9-6-10-14-24)34-31(38)32(2,3)28(20-17-23-11-7-5-8-12-23)35-29(36)26-18-15-25(22-33)16-19-26/h5-16,18-19,27-28H,4,17,20-21H2,1-3H3,(H,34,38)(H,35,36)/t27-,28?/m0/s1
n/an/a 250n/an/an/an/an/an/a
Nippon Steel Corporation
Curated by ChEMBL
Assay Description
In vitro inhibition of bovine alpha chymotrypsin.
J Med Chem 42: 312-23 (1999)
Article DOI: 10.1021/jm980562h
BindingDB Entry DOI: 10.7270/Q2930SBF