BDBM50074147 CHEMBL423599::N-Benzyl-N-{(R)-1-[2-(5-[1,2,4]triazol-4-yl-1H-indol-3-yl)-ethyl]-pyrrolidin-3-ylmethyl}-acetamide
SMILES: CC(=O)N(C[C@@H]1CCN(CCc2c[nH]c3ccc(cc23)-n2cnnc2)C1)Cc1ccccc1
InChI Key: InChIKey=POKWFAKJJPVMRZ-JOCHJYFZSA-N
Data: 2 IC50
Activity Spreadsheet -- Enzyme Inhibition Constant Data from BindingDB
Found 2 hits for monomerid = 50074147
Trg + Lig
Ki
nM
ΔG°
kcal/mole
IC50
nM
Kd
nM
EC50/IC50
nM
koff
s-1
kon
M-1s-1
pHTemp
°C
5-hydroxytryptamine receptor 1D
(Homo sapiens (Human))
BDBM50074147
(CHEMBL423599 | N-Benzyl-N-{(R)-1-[2-(5-[1,2,4]tria...)
Show SMILES CC(=O)N(C[C@@H]1CCN(CCc2c[nH]c3ccc(cc23)-n2cnnc2)C1)Cc1ccccc1
Show InChI InChI=1S/C26H30N6O/c1-20(33)31(16-21-5-3-2-4-6-21)17-22-9-11-30(15-22)12-10-23-14-27-26-8-7-24(13-25(23)26)32-18-28-29-19-32/h2-8,13-14,18-19,22,27H,9-12,15-17H2,1H3/t22-/m1/s1
Reactome pathway
n/an/a 1.10n/an/an/an/an/an/a
Merck, Sharp and Dohme Research Laboratories
Curated by ChEMBL
Assay Description
Displacement of [3H]-5-HT binding from the cloned human 5-hydroxytryptamine 1D receptor stably expressed in CHO cells
J Med Chem 42: 677-90 (1999)
Article DOI: 10.1021/jm9805687
BindingDB Entry DOI: 10.7270/Q23777W5
5-hydroxytryptamine receptor 1B
(Homo sapiens (Human))
BDBM50074147
(CHEMBL423599 | N-Benzyl-N-{(R)-1-[2-(5-[1,2,4]tria...)
Show SMILES CC(=O)N(C[C@@H]1CCN(CCc2c[nH]c3ccc(cc23)-n2cnnc2)C1)Cc1ccccc1
Show InChI InChI=1S/C26H30N6O/c1-20(33)31(16-21-5-3-2-4-6-21)17-22-9-11-30(15-22)12-10-23-14-27-26-8-7-24(13-25(23)26)32-18-28-29-19-32/h2-8,13-14,18-19,22,27H,9-12,15-17H2,1H3/t22-/m1/s1
Reactome pathway
n/an/a 11n/an/an/an/an/an/a
Merck, Sharp and Dohme Research Laboratories
Curated by ChEMBL
Assay Description
Displacement of [3H]-5-HT binding from the cloned human 5-hydroxytryptamine 1B receptor stably expressed in CHO cells
J Med Chem 42: 677-90 (1999)
Article DOI: 10.1021/jm9805687
BindingDB Entry DOI: 10.7270/Q23777W5