BDBM50074172 ((R)-1-Phenyl-ethyl)-{(S)-1-[2-(5-[1,2,4]triazol-4-yl-1H-indol-3-yl)-ethyl]-pyrrolidin-3-ylmethyl}-amine::CHEMBL161410
SMILES: C[C@@H](NC[C@@H]1CCN(CCc2c[nH]c3ccc(cc23)-n2cnnc2)C1)c1ccccc1
InChI Key: InChIKey=UNPAATNKWLYEKL-UXHICEINSA-N
Data: 2 IC50  1 EC50
Activity Spreadsheet -- Enzyme Inhibition Constant Data from BindingDB
Found 3 hits for monomerid = 50074172
Trg + Lig
Ki
nM
ΔG°
kcal/mole
IC50
nM
Kd
nM
EC50/IC50
nM
koff
s-1
kon
M-1s-1
pHTemp
°C
5-hydroxytryptamine receptor 1D
(Homo sapiens (Human))
BDBM50074172
(((R)-1-Phenyl-ethyl)-{(S)-1-[2-(5-[1,2,4]triazol-4...)
Show SMILES C[C@@H](NC[C@@H]1CCN(CCc2c[nH]c3ccc(cc23)-n2cnnc2)C1)c1ccccc1
Show InChI InChI=1S/C25H30N6/c1-19(21-5-3-2-4-6-21)26-14-20-9-11-30(16-20)12-10-22-15-27-25-8-7-23(13-24(22)25)31-17-28-29-18-31/h2-8,13,15,17-20,26-27H,9-12,14,16H2,1H3/t19-,20+/m1/s1
Reactome pathway
n/an/an/an/a 2.10n/an/an/an/a
Merck, Sharp and Dohme Research Laboratories
Curated by ChEMBL
Assay Description
Stimulation of [35S]-GTP-gammaS, binding in CHO cells expressing the 5-hydroxytryptamine 1D receptor
J Med Chem 42: 677-90 (1999)
Article DOI: 10.1021/jm9805687
BindingDB Entry DOI: 10.7270/Q23777W5
5-hydroxytryptamine receptor 1B
(Homo sapiens (Human))
BDBM50074172
(((R)-1-Phenyl-ethyl)-{(S)-1-[2-(5-[1,2,4]triazol-4...)
Show SMILES C[C@@H](NC[C@@H]1CCN(CCc2c[nH]c3ccc(cc23)-n2cnnc2)C1)c1ccccc1
Show InChI InChI=1S/C25H30N6/c1-19(21-5-3-2-4-6-21)26-14-20-9-11-30(16-20)12-10-22-15-27-25-8-7-23(13-24(22)25)31-17-28-29-18-31/h2-8,13,15,17-20,26-27H,9-12,14,16H2,1H3/t19-,20+/m1/s1
Reactome pathway
n/an/a 74n/an/an/an/an/an/a
Merck, Sharp and Dohme Research Laboratories
Curated by ChEMBL
Assay Description
Displacement of [3H]-5-HT binding from the cloned human 5-hydroxytryptamine 1B receptor stably expressed in CHO cells
J Med Chem 42: 677-90 (1999)
Article DOI: 10.1021/jm9805687
BindingDB Entry DOI: 10.7270/Q23777W5
5-hydroxytryptamine receptor 1D
(Homo sapiens (Human))
BDBM50074172
(((R)-1-Phenyl-ethyl)-{(S)-1-[2-(5-[1,2,4]triazol-4...)
Show SMILES C[C@@H](NC[C@@H]1CCN(CCc2c[nH]c3ccc(cc23)-n2cnnc2)C1)c1ccccc1
Show InChI InChI=1S/C25H30N6/c1-19(21-5-3-2-4-6-21)26-14-20-9-11-30(16-20)12-10-22-15-27-25-8-7-23(13-24(22)25)31-17-28-29-18-31/h2-8,13,15,17-20,26-27H,9-12,14,16H2,1H3/t19-,20+/m1/s1
Reactome pathway
n/an/a 0.720n/an/an/an/an/an/a
Merck, Sharp and Dohme Research Laboratories
Curated by ChEMBL
Assay Description
Displacement of [3H]-5-HT binding from the cloned human 5-hydroxytryptamine 1D receptor stably expressed in CHO cells
J Med Chem 42: 677-90 (1999)
Article DOI: 10.1021/jm9805687
BindingDB Entry DOI: 10.7270/Q23777W5