BDBM50074296 4-[[(E)-Isobutoxyimino]-(3,5,5,8,8-pentamethyl-5,6,7,8-tetrahydro-naphthalen-2-yl)-methyl]-benzoic acid::CHEMBL351943
SMILES: CC(C)CO\N=C(/c1ccc(cc1)C(O)=O)c1cc2c(cc1C)C(C)(C)CCC2(C)C
InChI Key: InChIKey=YTLIDOPETXYPLT-ZZIIXHQDSA-N
Data: 3 KI  3 EC50
Activity Spreadsheet -- Enzyme Inhibition Constant Data from BindingDB
Found 6 hits for monomerid = 50074296
Trg + Lig
Ki
nM
ΔG°
kcal/mole
IC50
nM
Kd
nM
EC50/IC50
nM
koff
s-1
kon
M-1s-1
pHTemp
°C
Retinoic acid receptor RXR-alpha
(Homo sapiens (Human))
BDBM50074296
(4-[[(E)-Isobutoxyimino]-(3,5,5,8,8-pentamethyl-5,6...)
Show SMILES CC(C)CO\N=C(/c1ccc(cc1)C(O)=O)c1cc2c(cc1C)C(C)(C)CCC2(C)C
Show InChI InChI=1S/C27H35NO3/c1-17(2)16-31-28-24(19-8-10-20(11-9-19)25(29)30)21-15-23-22(14-18(21)3)26(4,5)12-13-27(23,6)7/h8-11,14-15,17H,12-13,16H2,1-7H3,(H,29,30)/b28-24+
NCI pathway
Reactome pathway
21n/an/an/an/an/an/an/an/a
Ligand Pharmaceuticals, Inc
Curated by ChEMBL
Assay Description
Binding affinity towards recombinantly expressed Retinoic acid receptor RXR-alpha in baculoviral sysytem, by using 5 nM [3H]-targretin in a competiti...
J Med Chem 42: 742-50 (1999)
Article DOI: 10.1021/jm980621r
BindingDB Entry DOI: 10.7270/Q2K936Q1
Retinoid receptor
(Homo sapiens (Human))
BDBM50074296
(4-[[(E)-Isobutoxyimino]-(3,5,5,8,8-pentamethyl-5,6...)
Show SMILES CC(C)CO\N=C(/c1ccc(cc1)C(O)=O)c1cc2c(cc1C)C(C)(C)CCC2(C)C
Show InChI InChI=1S/C27H35NO3/c1-17(2)16-31-28-24(19-8-10-20(11-9-19)25(29)30)21-15-23-22(14-18(21)3)26(4,5)12-13-27(23,6)7/h8-11,14-15,17H,12-13,16H2,1-7H3,(H,29,30)/b28-24+
Reactome pathway
91n/an/an/an/an/an/an/an/a
Ligand Pharmaceuticals, Inc
Curated by ChEMBL
Assay Description
Binding affinity towards recombinantly expressed Retinoic acid receptor RXR-beta in baculoviral sysytem, by using 5 nM [3H]-targretin in a competitiv...
J Med Chem 42: 742-50 (1999)
Article DOI: 10.1021/jm980621r
BindingDB Entry DOI: 10.7270/Q2K936Q1
Retinoid X receptor gamma/retinoic acid receptor alpha
(Homo sapiens (Human))
BDBM50074296
(4-[[(E)-Isobutoxyimino]-(3,5,5,8,8-pentamethyl-5,6...)
Show SMILES CC(C)CO\N=C(/c1ccc(cc1)C(O)=O)c1cc2c(cc1C)C(C)(C)CCC2(C)C
Show InChI InChI=1S/C27H35NO3/c1-17(2)16-31-28-24(19-8-10-20(11-9-19)25(29)30)21-15-23-22(14-18(21)3)26(4,5)12-13-27(23,6)7/h8-11,14-15,17H,12-13,16H2,1-7H3,(H,29,30)/b28-24+
NCI pathway
Reactome pathway
323n/an/an/an/an/an/an/an/a
Ligand Pharmaceuticals, Inc
Curated by ChEMBL
Assay Description
Binding affinity towards recombinantly expressed Retinoic acid receptor RXR-gamma in baculoviral sysytem, by using 5 nM [3H]-targretin in a competiti...
J Med Chem 42: 742-50 (1999)
Article DOI: 10.1021/jm980621r
BindingDB Entry DOI: 10.7270/Q2K936Q1
Retinoid X receptor gamma/retinoic acid receptor alpha
(Homo sapiens (Human))
BDBM50074296
(4-[[(E)-Isobutoxyimino]-(3,5,5,8,8-pentamethyl-5,6...)
Show SMILES CC(C)CO\N=C(/c1ccc(cc1)C(O)=O)c1cc2c(cc1C)C(C)(C)CCC2(C)C
Show InChI InChI=1S/C27H35NO3/c1-17(2)16-31-28-24(19-8-10-20(11-9-19)25(29)30)21-15-23-22(14-18(21)3)26(4,5)12-13-27(23,6)7/h8-11,14-15,17H,12-13,16H2,1-7H3,(H,29,30)/b28-24+
NCI pathway
Reactome pathway
n/an/an/an/a 124n/an/an/an/a
Ligand Pharmaceuticals, Inc
Curated by ChEMBL
Assay Description
Transcriptional activity was evaluated in CV-1 cells transfected with expression vector for Retinoic acid receptor RXR-gamma
J Med Chem 42: 742-50 (1999)
Article DOI: 10.1021/jm980621r
BindingDB Entry DOI: 10.7270/Q2K936Q1
Retinoid receptor
(Homo sapiens (Human))
BDBM50074296
(4-[[(E)-Isobutoxyimino]-(3,5,5,8,8-pentamethyl-5,6...)
Show SMILES CC(C)CO\N=C(/c1ccc(cc1)C(O)=O)c1cc2c(cc1C)C(C)(C)CCC2(C)C
Show InChI InChI=1S/C27H35NO3/c1-17(2)16-31-28-24(19-8-10-20(11-9-19)25(29)30)21-15-23-22(14-18(21)3)26(4,5)12-13-27(23,6)7/h8-11,14-15,17H,12-13,16H2,1-7H3,(H,29,30)/b28-24+
Reactome pathway
n/an/an/an/a 106n/an/an/an/a
Ligand Pharmaceuticals, Inc
Curated by ChEMBL
Assay Description
Transcriptional activity was evaluated in CV-1 cells transfected with expression vector for Retinoic acid receptor RXR-beta
J Med Chem 42: 742-50 (1999)
Article DOI: 10.1021/jm980621r
BindingDB Entry DOI: 10.7270/Q2K936Q1
Retinoic acid receptor RXR-alpha
(Homo sapiens (Human))
BDBM50074296
(4-[[(E)-Isobutoxyimino]-(3,5,5,8,8-pentamethyl-5,6...)
Show SMILES CC(C)CO\N=C(/c1ccc(cc1)C(O)=O)c1cc2c(cc1C)C(C)(C)CCC2(C)C
Show InChI InChI=1S/C27H35NO3/c1-17(2)16-31-28-24(19-8-10-20(11-9-19)25(29)30)21-15-23-22(14-18(21)3)26(4,5)12-13-27(23,6)7/h8-11,14-15,17H,12-13,16H2,1-7H3,(H,29,30)/b28-24+
NCI pathway
Reactome pathway
n/an/an/an/a 116n/an/an/an/a
Ligand Pharmaceuticals, Inc
Curated by ChEMBL
Assay Description
Transcriptional activity was evaluated in CV-1 cells transfected with expression vector for Retinoic acid receptor RXR-alpha
J Med Chem 42: 742-50 (1999)
Article DOI: 10.1021/jm980621r
BindingDB Entry DOI: 10.7270/Q2K936Q1