null
SMILES: O=C1N(CCCC[n+]2ccc(CCCc3cc[n+](CCCCN4C(=O)c5ccccc5C4=O)cc3)cc2)C(=O)c2ccccc12
InChI Key: InChIKey=DQBFYPYEOZRLHH-UHFFFAOYSA-N
Activity Spreadsheet -- Enzyme Inhibition Constant Data from BindingDB
Found 1 hit for monomerid = 50074572
Trg + Lig
Ki
nM
ΔG°
kcal/mole
IC50
nM
Kd
nM
EC50/IC50
nM
koff
s-1
kon
M-1s-1
pHTemp
°C
Muscarinic acetylcholine receptor M2
(GUINEA PIG)
BDBM50074572
(2-{3-[4-(3-{1-[3-(1,3-dioxo-2,3-dihydro-1H-2-isoin...)
Show SMILES O=C1N(CCCC[n+]2ccc(CCCc3cc[n+](CCCCN4C(=O)c5ccccc5C4=O)cc3)cc2)C(=O)c2ccccc12
Show InChI InChI=1S/C37H38N4O4/c42-34-30-12-1-2-13-31(30)35(43)40(34)22-7-5-20-38-24-16-28(17-25-38)10-9-11-29-18-26-39(27-19-29)21-6-8-23-41-36(44)32-14-3-4-15-33(32)37(41)45/h1-4,12-19,24-27H,5-11,20-23H2/q+2
n/an/an/an/a 630n/an/an/an/a
University of Bonn
Curated by ChEMBL
Assay Description
Allosteric potency against the dissociation of radioligand [3H]-N-methylscopolamine from the porcine cardiac Muscarinic acetylcholine receptor M2
J Med Chem 42: 849-58 (1999)
Article DOI: 10.1021/jm981023f
BindingDB Entry DOI: 10.7270/Q22806RB