null
SMILES: COc1ccc(cc1OC1CCCC1)-c1ccc(o1)-c1ccncc1
InChI Key: InChIKey=ICJQTLVNQXGYND-UHFFFAOYSA-N
Activity Spreadsheet -- Enzyme Inhibition Constant Data from BindingDB
Found 1 hit for monomerid = 50074965
Trg + Lig
Ki
nM
ΔG°
kcal/mole
IC50
nM
Kd
nM
EC50/IC50
nM
koff
s-1
kon
M-1s-1
pHTemp
°C
cAMP-specific 3',5'-cyclic phosphodiesterase 4A
(Homo sapiens (Human))
BDBM50074965
(4-[5-(3-Cyclopentyloxy-4-methoxy-phenyl)-furan-2-y...)
Show SMILES COc1ccc(cc1OC1CCCC1)-c1ccc(o1)-c1ccncc1
Show InChI InChI=1S/C21H21NO3/c1-23-20-7-6-16(14-21(20)24-17-4-2-3-5-17)19-9-8-18(25-19)15-10-12-22-13-11-15/h6-14,17H,2-5H2,1H3
n/an/a 65n/an/an/an/an/an/a
Merck Frosst Centre for Therapeutic Research
Curated by ChEMBL
Assay Description
PDE4A activity assessed using human recombinant purified GST-PDE4A248
Bioorg Med Chem Lett 9: 323-6 (1999)
BindingDB Entry DOI: 10.7270/Q27S7MXX