null
SMILES: COc1ccc(cc1OC)-c1cc(C(C)=O)c(o1)-c1ccc(OC)c(OC)c1
InChI Key: InChIKey=WZPVMPDLQDZGQB-UHFFFAOYSA-N
Activity Spreadsheet -- Enzyme Inhibition Constant Data from BindingDB
Found 1 hit for monomerid = 50074974
Trg + Lig
Ki
nM
ΔG°
kcal/mole
IC50
nM
Kd
nM
EC50/IC50
nM
koff
s-1
kon
M-1s-1
pHTemp
°C
cAMP-specific 3',5'-cyclic phosphodiesterase 4A
(Homo sapiens (Human))
BDBM50074974
(1-[2,5-Bis-(3,4-dimethoxy-phenyl)-furan-3-yl]-etha...)
Show SMILES COc1ccc(cc1OC)-c1cc(C(C)=O)c(o1)-c1ccc(OC)c(OC)c1
Show InChI InChI=1S/C22H22O6/c1-13(23)16-12-19(14-6-8-17(24-2)20(10-14)26-4)28-22(16)15-7-9-18(25-3)21(11-15)27-5/h6-12H,1-5H3
n/an/a 120n/an/an/an/an/an/a
Merck Frosst Centre for Therapeutic Research
Curated by ChEMBL
Assay Description
PDE4A activity assessed using human recombinant purified GST-PDE4A248
Bioorg Med Chem Lett 9: 323-6 (1999)
BindingDB Entry DOI: 10.7270/Q27S7MXX