null
SMILES: CCn1c(C(c2ccc(F)cc2)n2ccnc2)c(C)c2cc(Br)ccc12
InChI Key: InChIKey=AGDFPJBCGAJMIS-UHFFFAOYSA-N
Activity Spreadsheet -- Enzyme Inhibition Constant Data from BindingDB
Found 1 hit for monomerid = 50075007
Trg + Lig
Ki
nM
ΔG°
kcal/mole
IC50
nM
Kd
nM
EC50/IC50
nM
koff
s-1
kon
M-1s-1
pHTemp
°C
Aromatase
(Homo sapiens (Human))
BDBM50075007
(5-Bromo-1-ethyl-2-[(4-fluoro-phenyl)-imidazol-1-yl...)
Show SMILES CCn1c(C(c2ccc(F)cc2)n2ccnc2)c(C)c2cc(Br)ccc12
Show InChI InChI=1S/C21H19BrFN3/c1-3-26-19-9-6-16(22)12-18(19)14(2)20(26)21(25-11-10-24-13-25)15-4-7-17(23)8-5-15/h4-13,21H,3H2,1-2H3
Reactome pathway
n/an/a 238n/an/an/an/an/an/a
Nantes
Curated by ChEMBL
Assay Description
In vitro inhibition of human Cytochrome P450 19A1
Bioorg Med Chem Lett 9: 333-6 (1999)
BindingDB Entry DOI: 10.7270/Q20C4TXZ