BDBM50075112 1,1-dimethyl-2-propylcarboxamidooctanoic anhydride::CHEMBL131794
SMILES: CCCCCC(NC(=O)CCC)C(C)(C)C(=O)OC(=O)C(C)(C)C(CCCCC)NC(=O)CCC
InChI Key: InChIKey=NMRBYFIBVCAQJV-UHFFFAOYSA-N
Data: 5 IC50
Activity Spreadsheet -- Enzyme Inhibition Constant Data from BindingDB
Found 5 hits for monomerid = 50075112
Trg + Lig
Ki
nM
ΔG°
kcal/mole
IC50
nM
Kd
nM
EC50/IC50
nM
koff
s-1
kon
M-1s-1
pHTemp
°C
Cathepsin G
(Homo sapiens (Human))
BDBM50075112
(1,1-dimethyl-2-propylcarboxamidooctanoic anhydride...)
Show SMILES CCCCCC(NC(=O)CCC)C(C)(C)C(=O)OC(=O)C(C)(C)C(CCCCC)NC(=O)CCC
Show InChI InChI=1S/C28H52N2O5/c1-9-13-15-19-21(29-23(31)17-11-3)27(5,6)25(33)35-26(34)28(7,8)22(20-16-14-10-2)30-24(32)18-12-4/h21-22H,9-20H2,1-8H3,(H,29,31)(H,30,32)
NCI pathway
Reactome pathway
n/an/a 1.60E+3n/an/an/an/an/an/a
Nippon Steel Corporation
Curated by ChEMBL
Assay Description
Inhibitory activity against human leukocyte cathepsin G (h-CG)
Bioorg Med Chem Lett 9: 413-8 (1999)
BindingDB Entry DOI: 10.7270/Q2BK1BGC
Pancreatic elastase
(Sus scrofa)
BDBM50075112
(1,1-dimethyl-2-propylcarboxamidooctanoic anhydride...)
Show SMILES CCCCCC(NC(=O)CCC)C(C)(C)C(=O)OC(=O)C(C)(C)C(CCCCC)NC(=O)CCC
Show InChI InChI=1S/C28H52N2O5/c1-9-13-15-19-21(29-23(31)17-11-3)27(5,6)25(33)35-26(34)28(7,8)22(20-16-14-10-2)30-24(32)18-12-4/h21-22H,9-20H2,1-8H3,(H,29,31)(H,30,32)
n/an/a 55n/an/an/an/an/an/a
Nippon Steel Corporation
Curated by ChEMBL
Assay Description
Inhibitory activity against porcine pancreatic elastase (PPE)
Bioorg Med Chem Lett 9: 413-8 (1999)
BindingDB Entry DOI: 10.7270/Q2BK1BGC
Beta-chymotrypsin
(Homo sapiens (Human))
BDBM50075112
(1,1-dimethyl-2-propylcarboxamidooctanoic anhydride...)
Show SMILES CCCCCC(NC(=O)CCC)C(C)(C)C(=O)OC(=O)C(C)(C)C(CCCCC)NC(=O)CCC
Show InChI InChI=1S/C28H52N2O5/c1-9-13-15-19-21(29-23(31)17-11-3)27(5,6)25(33)35-26(34)28(7,8)22(20-16-14-10-2)30-24(32)18-12-4/h21-22H,9-20H2,1-8H3,(H,29,31)(H,30,32)
n/an/a 810n/an/an/an/an/an/a
Nippon Steel Corporation
Curated by ChEMBL
Assay Description
Inhibitory activity against bovine pancreatic alpha-chymotrypsin (alpha-CT)
Bioorg Med Chem Lett 9: 413-8 (1999)
BindingDB Entry DOI: 10.7270/Q2BK1BGC
Chymase
(Homo sapiens (Human))
BDBM50075112
(1,1-dimethyl-2-propylcarboxamidooctanoic anhydride...)
Show SMILES CCCCCC(NC(=O)CCC)C(C)(C)C(=O)OC(=O)C(C)(C)C(CCCCC)NC(=O)CCC
Show InChI InChI=1S/C28H52N2O5/c1-9-13-15-19-21(29-23(31)17-11-3)27(5,6)25(33)35-26(34)28(7,8)22(20-16-14-10-2)30-24(32)18-12-4/h21-22H,9-20H2,1-8H3,(H,29,31)(H,30,32)
Reactome pathway
n/an/a 2.90E+4n/an/an/an/an/an/a
Nippon Steel Corporation
Curated by ChEMBL
Assay Description
Inhibitory activity against human chymase (h-chymase)
Bioorg Med Chem Lett 9: 413-8 (1999)
BindingDB Entry DOI: 10.7270/Q2BK1BGC
Trypsin-1
(Homo sapiens (Human))
BDBM50075112
(1,1-dimethyl-2-propylcarboxamidooctanoic anhydride...)
Show SMILES CCCCCC(NC(=O)CCC)C(C)(C)C(=O)OC(=O)C(C)(C)C(CCCCC)NC(=O)CCC
Show InChI InChI=1S/C28H52N2O5/c1-9-13-15-19-21(29-23(31)17-11-3)27(5,6)25(33)35-26(34)28(7,8)22(20-16-14-10-2)30-24(32)18-12-4/h21-22H,9-20H2,1-8H3,(H,29,31)(H,30,32)
Reactome pathway
n/an/a 1.80E+4n/an/an/an/an/an/a
Nippon Steel Corporation
Curated by ChEMBL
Assay Description
Inhibitory activity against porcine pancreatic trypsin (TRP)
Bioorg Med Chem Lett 9: 413-8 (1999)
BindingDB Entry DOI: 10.7270/Q2BK1BGC