BDBM50075118 1,1-dimethyl-2-phenylcarboxamidohexanoic anhydride::CHEMBL131704
SMILES: CCCC(NC(=O)c1ccccc1)C(C)(C)C(=O)OC(=O)C(C)(C)C(CCC)NC(=O)c1ccccc1
InChI Key: InChIKey=HPGZOBMWVCIJEN-UHFFFAOYSA-N
Data: 5 IC50
Activity Spreadsheet -- Enzyme Inhibition Constant Data from BindingDB
Found 5 hits for monomerid = 50075118
Trg + Lig
Ki
nM
ΔG°
kcal/mole
IC50
nM
Kd
nM
EC50/IC50
nM
koff
s-1
kon
M-1s-1
pHTemp
°C
Chymase
(Homo sapiens (Human))
BDBM50075118
(1,1-dimethyl-2-phenylcarboxamidohexanoic anhydride...)
Show SMILES CCCC(NC(=O)c1ccccc1)C(C)(C)C(=O)OC(=O)C(C)(C)C(CCC)NC(=O)c1ccccc1
Show InChI InChI=1S/C30H40N2O5/c1-7-15-23(31-25(33)21-17-11-9-12-18-21)29(3,4)27(35)37-28(36)30(5,6)24(16-8-2)32-26(34)22-19-13-10-14-20-22/h9-14,17-20,23-24H,7-8,15-16H2,1-6H3,(H,31,33)(H,32,34)
Reactome pathway
n/an/a 58n/an/an/an/an/an/a
Nippon Steel Corporation
Curated by ChEMBL
Assay Description
Inhibitory activity against human chymase (h-chymase)
Bioorg Med Chem Lett 9: 413-8 (1999)
BindingDB Entry DOI: 10.7270/Q2BK1BGC
Cathepsin G
(Homo sapiens (Human))
BDBM50075118
(1,1-dimethyl-2-phenylcarboxamidohexanoic anhydride...)
Show SMILES CCCC(NC(=O)c1ccccc1)C(C)(C)C(=O)OC(=O)C(C)(C)C(CCC)NC(=O)c1ccccc1
Show InChI InChI=1S/C30H40N2O5/c1-7-15-23(31-25(33)21-17-11-9-12-18-21)29(3,4)27(35)37-28(36)30(5,6)24(16-8-2)32-26(34)22-19-13-10-14-20-22/h9-14,17-20,23-24H,7-8,15-16H2,1-6H3,(H,31,33)(H,32,34)
NCI pathway
Reactome pathway
n/an/a 75n/an/an/an/an/an/a
Nippon Steel Corporation
Curated by ChEMBL
Assay Description
Inhibitory activity against human leukocyte cathepsin G (h-CG)
Bioorg Med Chem Lett 9: 413-8 (1999)
BindingDB Entry DOI: 10.7270/Q2BK1BGC
Beta-chymotrypsin
(Homo sapiens (Human))
BDBM50075118
(1,1-dimethyl-2-phenylcarboxamidohexanoic anhydride...)
Show SMILES CCCC(NC(=O)c1ccccc1)C(C)(C)C(=O)OC(=O)C(C)(C)C(CCC)NC(=O)c1ccccc1
Show InChI InChI=1S/C30H40N2O5/c1-7-15-23(31-25(33)21-17-11-9-12-18-21)29(3,4)27(35)37-28(36)30(5,6)24(16-8-2)32-26(34)22-19-13-10-14-20-22/h9-14,17-20,23-24H,7-8,15-16H2,1-6H3,(H,31,33)(H,32,34)
n/an/a 49n/an/an/an/an/an/a
Nippon Steel Corporation
Curated by ChEMBL
Assay Description
Inhibitory activity against bovine pancreatic alpha-chymotrypsin (alpha-CT)
Bioorg Med Chem Lett 9: 413-8 (1999)
BindingDB Entry DOI: 10.7270/Q2BK1BGC
Trypsin-1
(Homo sapiens (Human))
BDBM50075118
(1,1-dimethyl-2-phenylcarboxamidohexanoic anhydride...)
Show SMILES CCCC(NC(=O)c1ccccc1)C(C)(C)C(=O)OC(=O)C(C)(C)C(CCC)NC(=O)c1ccccc1
Show InChI InChI=1S/C30H40N2O5/c1-7-15-23(31-25(33)21-17-11-9-12-18-21)29(3,4)27(35)37-28(36)30(5,6)24(16-8-2)32-26(34)22-19-13-10-14-20-22/h9-14,17-20,23-24H,7-8,15-16H2,1-6H3,(H,31,33)(H,32,34)
Reactome pathway
n/an/a 8.80E+3n/an/an/an/an/an/a
Nippon Steel Corporation
Curated by ChEMBL
Assay Description
Inhibitory activity against porcine pancreatic trypsin (TRP)
Bioorg Med Chem Lett 9: 413-8 (1999)
BindingDB Entry DOI: 10.7270/Q2BK1BGC
Pancreatic elastase
(Sus scrofa)
BDBM50075118
(1,1-dimethyl-2-phenylcarboxamidohexanoic anhydride...)
Show SMILES CCCC(NC(=O)c1ccccc1)C(C)(C)C(=O)OC(=O)C(C)(C)C(CCC)NC(=O)c1ccccc1
Show InChI InChI=1S/C30H40N2O5/c1-7-15-23(31-25(33)21-17-11-9-12-18-21)29(3,4)27(35)37-28(36)30(5,6)24(16-8-2)32-26(34)22-19-13-10-14-20-22/h9-14,17-20,23-24H,7-8,15-16H2,1-6H3,(H,31,33)(H,32,34)
n/an/a 58n/an/an/an/an/an/a
Nippon Steel Corporation
Curated by ChEMBL
Assay Description
Inhibitory activity against porcine pancreatic elastase (PPE)
Bioorg Med Chem Lett 9: 413-8 (1999)
BindingDB Entry DOI: 10.7270/Q2BK1BGC