BDBM50075142 CHEMBL138470::N-[(S)-1-(5-Methyl-4-oxo-4H-thieno[2,3-d][1,3]oxazin-2-yl)-ethyl]-3,3-di-thiophen-2-yl-acrylamide
SMILES: [#6]-[#6@H](-[#7]-[#6](=O)\[#6]=[#6](\c1cccs1)-c1cccs1)-c1nc2scc(-[#6])c2c(=O)o1
InChI Key: InChIKey=VRXLLJLYQUWRJL-LBPRGKRZSA-N
Data: 3 IC50
Activity Spreadsheet -- Enzyme Inhibition Constant Data from BindingDB
Found 3 hits for monomerid = 50075142
Trg + Lig
Ki
nM
ΔG°
kcal/mole
IC50
nM
Kd
nM
EC50/IC50
nM
koff
s-1
kon
M-1s-1
pHTemp
°C
Human herpesvirus 4 protease/capsid scaffold protein
(Epstein-Barr virus (strain B95-8) (HHV-4) (Human h...)
BDBM50075142
(CHEMBL138470 | N-[(S)-1-(5-Methyl-4-oxo-4H-thieno[...)
Show SMILES [#6]-[#6@H](-[#7]-[#6](=O)\[#6]=[#6](\c1cccs1)-c1cccs1)-c1nc2scc(-[#6])c2c(=O)o1
Show InChI InChI=1S/C20H16N2O3S3/c1-11-10-28-19-17(11)20(24)25-18(22-19)12(2)21-16(23)9-13(14-5-3-7-26-14)15-6-4-8-27-15/h3-10,12H,1-2H3,(H,21,23)/t12-/m0/s1
n/an/a 250n/an/an/an/an/an/a
SmithKline Beecham Pharmaceuticals
Curated by ChEMBL
Assay Description
Inhibitory activity against cytomegalovirus (CMV) protease was determined using quenched fluorescence assay
Bioorg Med Chem Lett 9: 443-8 (1999)
BindingDB Entry DOI: 10.7270/Q2ZC822V
Human herpesvirus 6 protease
(Human herpesvirus 6A (strain Uganda-1102) (HHV-6 v...)
BDBM50075142
(CHEMBL138470 | N-[(S)-1-(5-Methyl-4-oxo-4H-thieno[...)
Show SMILES [#6]-[#6@H](-[#7]-[#6](=O)\[#6]=[#6](\c1cccs1)-c1cccs1)-c1nc2scc(-[#6])c2c(=O)o1
Show InChI InChI=1S/C20H16N2O3S3/c1-11-10-28-19-17(11)20(24)25-18(22-19)12(2)21-16(23)9-13(14-5-3-7-26-14)15-6-4-8-27-15/h3-10,12H,1-2H3,(H,21,23)/t12-/m0/s1
n/an/a 42n/an/an/an/an/an/a
SmithKline Beecham Pharmaceuticals
Curated by ChEMBL
Assay Description
Inhibitory activity against Varicella Zoster Virus (VZV) protease was determined using quenched fluorescence assay
Bioorg Med Chem Lett 9: 443-8 (1999)
BindingDB Entry DOI: 10.7270/Q2ZC822V
Human herpesvirus 2 protease
(Human herpesvirus 2 (strain HG52) (HHV-2) (Human h...)
BDBM50075142
(CHEMBL138470 | N-[(S)-1-(5-Methyl-4-oxo-4H-thieno[...)
Show SMILES [#6]-[#6@H](-[#7]-[#6](=O)\[#6]=[#6](\c1cccs1)-c1cccs1)-c1nc2scc(-[#6])c2c(=O)o1
Show InChI InChI=1S/C20H16N2O3S3/c1-11-10-28-19-17(11)20(24)25-18(22-19)12(2)21-16(23)9-13(14-5-3-7-26-14)15-6-4-8-27-15/h3-10,12H,1-2H3,(H,21,23)/t12-/m0/s1
n/an/a 110n/an/an/an/an/an/a
SmithKline Beecham Pharmaceuticals
Curated by ChEMBL
Assay Description
Inhibitory activity against herpes simplex virus type 2 (HSV-2) protease was determined using quenched fluorescence assay
Bioorg Med Chem Lett 9: 443-8 (1999)
BindingDB Entry DOI: 10.7270/Q2ZC822V