BDBM50075151 CHEMBL141722::N-[(S)-1-(5-Methyl-4-oxo-4H-thieno[2,3-d][1,3]oxazin-2-yl)-ethyl]-3,3-diphenyl-acrylamide
SMILES: [#6]-[#6@H](-[#7]-[#6](=O)\[#6]=[#6](\c1ccccc1)-c1ccccc1)-c1nc2scc(-[#6])c2c(=O)o1
InChI Key: InChIKey=OAGFVVCBRGQAJA-INIZCTEOSA-N
Data: 3 IC50
Activity Spreadsheet -- Enzyme Inhibition Constant Data from BindingDB
Found 3 hits for monomerid = 50075151
Trg + Lig
Ki
nM
ΔG°
kcal/mole
IC50
nM
Kd
nM
EC50/IC50
nM
koff
s-1
kon
M-1s-1
pHTemp
°C
Human herpesvirus 4 protease/capsid scaffold protein
(Epstein-Barr virus (strain B95-8) (HHV-4) (Human h...)
BDBM50075151
(CHEMBL141722 | N-[(S)-1-(5-Methyl-4-oxo-4H-thieno[...)
Show SMILES [#6]-[#6@H](-[#7]-[#6](=O)\[#6]=[#6](\c1ccccc1)-c1ccccc1)-c1nc2scc(-[#6])c2c(=O)o1
Show InChI InChI=1S/C24H20N2O3S/c1-15-14-30-23-21(15)24(28)29-22(26-23)16(2)25-20(27)13-19(17-9-5-3-6-10-17)18-11-7-4-8-12-18/h3-14,16H,1-2H3,(H,25,27)/t16-/m0/s1
n/an/a 910n/an/an/an/an/an/a
SmithKline Beecham Pharmaceuticals
Curated by ChEMBL
Assay Description
Inhibitory activity against cytomegalovirus (CMV) protease was determined using quenched fluorescence assay
Bioorg Med Chem Lett 9: 443-8 (1999)
BindingDB Entry DOI: 10.7270/Q2ZC822V
Human herpesvirus 6 protease
(Human herpesvirus 6A (strain Uganda-1102) (HHV-6 v...)
BDBM50075151
(CHEMBL141722 | N-[(S)-1-(5-Methyl-4-oxo-4H-thieno[...)
Show SMILES [#6]-[#6@H](-[#7]-[#6](=O)\[#6]=[#6](\c1ccccc1)-c1ccccc1)-c1nc2scc(-[#6])c2c(=O)o1
Show InChI InChI=1S/C24H20N2O3S/c1-15-14-30-23-21(15)24(28)29-22(26-23)16(2)25-20(27)13-19(17-9-5-3-6-10-17)18-11-7-4-8-12-18/h3-14,16H,1-2H3,(H,25,27)/t16-/m0/s1
n/an/a 37n/an/an/an/an/an/a
SmithKline Beecham Pharmaceuticals
Curated by ChEMBL
Assay Description
Inhibitory activity against Varicella Zoster Virus (VZV) protease was determined using quenched fluorescence assay
Bioorg Med Chem Lett 9: 443-8 (1999)
BindingDB Entry DOI: 10.7270/Q2ZC822V
Human herpesvirus 2 protease
(Human herpesvirus 2 (strain HG52) (HHV-2) (Human h...)
BDBM50075151
(CHEMBL141722 | N-[(S)-1-(5-Methyl-4-oxo-4H-thieno[...)
Show SMILES [#6]-[#6@H](-[#7]-[#6](=O)\[#6]=[#6](\c1ccccc1)-c1ccccc1)-c1nc2scc(-[#6])c2c(=O)o1
Show InChI InChI=1S/C24H20N2O3S/c1-15-14-30-23-21(15)24(28)29-22(26-23)16(2)25-20(27)13-19(17-9-5-3-6-10-17)18-11-7-4-8-12-18/h3-14,16H,1-2H3,(H,25,27)/t16-/m0/s1
n/an/a 500n/an/an/an/an/an/a
SmithKline Beecham Pharmaceuticals
Curated by ChEMBL
Assay Description
Inhibitory activity against herpes simplex virus type 2 (HSV-2) protease was determined using quenched fluorescence assay
Bioorg Med Chem Lett 9: 443-8 (1999)
BindingDB Entry DOI: 10.7270/Q2ZC822V