BDBM50075155 (E)-3-(2-Bromo-thiophen-3-yl)-N-[(S)-1-(5-methyl-4-oxo-4H-thieno[2,3-d][1,3]oxazin-2-yl)-ethyl]-acrylamide::CHEMBL139059
SMILES: C[C@H](NC(=O)\C=C\c1ccsc1Br)c1nc2scc(C)c2c(=O)o1
InChI Key: InChIKey=QEEOIXJVMCZVIR-NWALNABHSA-N
Data: 3 IC50
Activity Spreadsheet -- Enzyme Inhibition Constant Data from BindingDB
Found 3 hits for monomerid = 50075155
Trg + Lig
Ki
nM
ΔG°
kcal/mole
IC50
nM
Kd
nM
EC50/IC50
nM
koff
s-1
kon
M-1s-1
pHTemp
°C
Human herpesvirus 6 protease
(Human herpesvirus 6A (strain Uganda-1102) (HHV-6 v...)
BDBM50075155
((E)-3-(2-Bromo-thiophen-3-yl)-N-[(S)-1-(5-methyl-4...)
Show SMILES C[C@H](NC(=O)\C=C\c1ccsc1Br)c1nc2scc(C)c2c(=O)o1
Show InChI InChI=1S/C16H13BrN2O3S2/c1-8-7-24-15-12(8)16(21)22-14(19-15)9(2)18-11(20)4-3-10-5-6-23-13(10)17/h3-7,9H,1-2H3,(H,18,20)/b4-3+/t9-/m0/s1
n/an/a 51n/an/an/an/an/an/a
SmithKline Beecham Pharmaceuticals
Curated by ChEMBL
Assay Description
Inhibitory activity against Varicella Zoster Virus (VZV) protease was determined using quenched fluorescence assay
Bioorg Med Chem Lett 9: 443-8 (1999)
BindingDB Entry DOI: 10.7270/Q2ZC822V
Human herpesvirus 4 protease/capsid scaffold protein
(Epstein-Barr virus (strain B95-8) (HHV-4) (Human h...)
BDBM50075155
((E)-3-(2-Bromo-thiophen-3-yl)-N-[(S)-1-(5-methyl-4...)
Show SMILES C[C@H](NC(=O)\C=C\c1ccsc1Br)c1nc2scc(C)c2c(=O)o1
Show InChI InChI=1S/C16H13BrN2O3S2/c1-8-7-24-15-12(8)16(21)22-14(19-15)9(2)18-11(20)4-3-10-5-6-23-13(10)17/h3-7,9H,1-2H3,(H,18,20)/b4-3+/t9-/m0/s1
n/an/a 620n/an/an/an/an/an/a
SmithKline Beecham Pharmaceuticals
Curated by ChEMBL
Assay Description
Inhibitory activity against cytomegalovirus (CMV) protease was determined using quenched fluorescence assay
Bioorg Med Chem Lett 9: 443-8 (1999)
BindingDB Entry DOI: 10.7270/Q2ZC822V
Human herpesvirus 2 protease
(Human herpesvirus 2 (strain HG52) (HHV-2) (Human h...)
BDBM50075155
((E)-3-(2-Bromo-thiophen-3-yl)-N-[(S)-1-(5-methyl-4...)
Show SMILES C[C@H](NC(=O)\C=C\c1ccsc1Br)c1nc2scc(C)c2c(=O)o1
Show InChI InChI=1S/C16H13BrN2O3S2/c1-8-7-24-15-12(8)16(21)22-14(19-15)9(2)18-11(20)4-3-10-5-6-23-13(10)17/h3-7,9H,1-2H3,(H,18,20)/b4-3+/t9-/m0/s1
n/an/a 200n/an/an/an/an/an/a
SmithKline Beecham Pharmaceuticals
Curated by ChEMBL
Assay Description
Inhibitory activity against herpes simplex virus type 2 (HSV-2) protease was determined using quenched fluorescence assay
Bioorg Med Chem Lett 9: 443-8 (1999)
BindingDB Entry DOI: 10.7270/Q2ZC822V