BDBM50075182 CHEMBL3414633
SMILES: Oc1ccc(NS(=O)(=O)c2ccc(Cl)c(c2)[N+]([O-])=O)c2ccccc12
InChI Key: InChIKey=JDYDEJYIVZNWQU-UHFFFAOYSA-N
Data: 2 IC50
Activity Spreadsheet -- Enzyme Inhibition Constant Data from BindingDB
Found 2 hits for monomerid = 50075182
Trg + Lig
Ki
nM
ΔG°
kcal/mole
IC50
nM
Kd
nM
EC50/IC50
nM
koff
s-1
kon
M-1s-1
pHTemp
°C
DNA (cytosine-5)-methyltransferase 1 (DNMT1)
(Homo sapiens (Human))
BDBM50075182
(CHEMBL3414633)
Show SMILES Oc1ccc(NS(=O)(=O)c2ccc(Cl)c(c2)[N+]([O-])=O)c2ccccc12
Show InChI InChI=1S/C16H11ClN2O5S/c17-13-6-5-10(9-15(13)19(21)22)25(23,24)18-14-7-8-16(20)12-4-2-1-3-11(12)14/h1-9,18,20H
n/an/a 1.20E+4n/an/an/an/an/an/a
CNRS-Pierre Fabre
Curated by ChEMBL
Assay Description
Inhibition of His6-tagged human recombinant DNMT1 expressed in insect Sf9 cells assessed as reduction in DNA methyltransferase activity using 5'-biot...
J Med Chem 58: 2569-83 (2015)
Article DOI: 10.1021/jm500843d
BindingDB Entry DOI: 10.7270/Q24T6M36
DNMT3A2/3L complex
(Homo sapiens (Human))
BDBM50075182
(CHEMBL3414633)
Show SMILES Oc1ccc(NS(=O)(=O)c2ccc(Cl)c(c2)[N+]([O-])=O)c2ccccc12
Show InChI InChI=1S/C16H11ClN2O5S/c17-13-6-5-10(9-15(13)19(21)22)25(23,24)18-14-7-8-16(20)12-4-2-1-3-11(12)14/h1-9,18,20H
Reactome pathway
n/an/a 3.80E+4n/an/an/an/an/an/a
CNRS-Pierre Fabre
Curated by ChEMBL
Assay Description
Inhibition of His6-tagged human recombinant DNMT3a expressed in insect Sf9 cells assessed as reduction in DNA methyltransferase activity using 5'-bio...
J Med Chem 58: 2569-83 (2015)
Article DOI: 10.1021/jm500843d
BindingDB Entry DOI: 10.7270/Q24T6M36