null
SMILES: [Br-].C[N+](C)(CCCCNC(=O)c1cn(Cc2ccccc2)c2cc(Cl)c(F)cc2c1=O)CC#CCOC1=NOCC1
InChI Key: InChIKey=CDPJKPWBAQEYPO-UHFFFAOYSA-O
Activity Spreadsheet -- Enzyme Inhibition Constant Data from BindingDB
Found 2 hits for monomerid = 50075198
Trg + Lig
Ki
nM
ΔG°
kcal/mole
IC50
nM
Kd
nM
EC50/IC50
nM
koff
s-1
kon
M-1s-1
pHTemp
°C
Muscarinic acetylcholine receptor M1
(Homo sapiens (Human))
BDBM50075198
(CHEMBL3414840)
Show SMILES [Br-].C[N+](C)(CCCCNC(=O)c1cn(Cc2ccccc2)c2cc(Cl)c(F)cc2c1=O)CC#CCOC1=NOCC1 |t:38|
Show InChI InChI=1S/C30H32ClFN4O4/c1-36(2,15-8-9-16-39-28-12-17-40-34-28)14-7-6-13-33-30(38)24-21-35(20-22-10-4-3-5-11-22)27-19-25(31)26(32)18-23(27)29(24)37/h3-5,10-11,18-19,21H,6-7,12-17,20H2,1-2H3/p+1
n/an/an/a 72n/an/an/an/an/a
University of W£rzburg
Curated by ChEMBL
Assay Description
Displacement of [3H]NMS from human muscarinic M1 acetylcholine receptor expressed in CHO cell membranes by radioligand binding assay
J Med Chem 58: 560-76 (2015)
Article DOI: 10.1021/jm500860w
BindingDB Entry DOI: 10.7270/Q2125VCS
Muscarinic acetylcholine receptor M1
(Homo sapiens (Human))
BDBM50075198
(CHEMBL3414840)
Show SMILES [Br-].C[N+](C)(CCCCNC(=O)c1cn(Cc2ccccc2)c2cc(Cl)c(F)cc2c1=O)CC#CCOC1=NOCC1 |t:38|
Show InChI InChI=1S/C30H32ClFN4O4/c1-36(2,15-8-9-16-39-28-12-17-40-34-28)14-7-6-13-33-30(38)24-21-35(20-22-10-4-3-5-11-22)27-19-25(31)26(32)18-23(27)29(24)37/h3-5,10-11,18-19,21H,6-7,12-17,20H2,1-2H3/p+1
n/an/an/an/a 32n/an/an/an/a
University of W£rzburg
Curated by ChEMBL
Assay Description
Partial agonist activity at human muscarinic M1 acetylcholine receptor expressed in CHO cells assessed as increase in IP1 accumulation incubated for ...
J Med Chem 58: 560-76 (2015)
Article DOI: 10.1021/jm500860w
BindingDB Entry DOI: 10.7270/Q2125VCS