BDBM50075335 2-(2,6-Diisopropyl-phenyl)-5-nitro-isoindole-1,3-dione::2-(2,6-diisopropylphenyl)-5-nitroisoindoline-1,3-dione::CHEMBL91130
SMILES: CC(C)c1cccc(C(C)C)c1N1C(=O)c2ccc(cc2C1=O)[N+]([O-])=O
InChI Key: InChIKey=RLDVEPIZIKRKPK-UHFFFAOYSA-N
Data: 4 IC50
Activity Spreadsheet -- Enzyme Inhibition Constant Data from BindingDB
Found 4 hits for monomerid = 50075335
Trg + Lig
Ki
nM
ΔG°
kcal/mole
IC50
nM
Kd
nM
EC50/IC50
nM
koff
s-1
kon
M-1s-1
pHTemp
°C
Dipeptidyl peptidase 4
(Homo sapiens (Human))
BDBM50075335
(2-(2,6-Diisopropyl-phenyl)-5-nitro-isoindole-1,3-d...)
Show SMILES CC(C)c1cccc(C(C)C)c1N1C(=O)c2ccc(cc2C1=O)[N+]([O-])=O
Show InChI InChI=1S/C20H20N2O4/c1-11(2)14-6-5-7-15(12(3)4)18(14)21-19(23)16-9-8-13(22(25)26)10-17(16)20(21)24/h5-12H,1-4H3
Reactome pathway
n/an/a>100n/an/an/an/an/an/a
University of Tokyo
Curated by ChEMBL
Assay Description
Inhibitory activity against Dipeptidylpeptidase IV (DPP IV) in human acute lymphoblastic leukemia MOLT-4 cell line
Bioorg Med Chem Lett 9: 559-62 (1999)
BindingDB Entry DOI: 10.7270/Q2ZW1MFX
Aminopeptidase
(Homo sapiens (Human))
BDBM50075335
(2-(2,6-Diisopropyl-phenyl)-5-nitro-isoindole-1,3-d...)
Show SMILES CC(C)c1cccc(C(C)C)c1N1C(=O)c2ccc(cc2C1=O)[N+]([O-])=O
Show InChI InChI=1S/C20H20N2O4/c1-11(2)14-6-5-7-15(12(3)4)18(14)21-19(23)16-9-8-13(22(25)26)10-17(16)20(21)24/h5-12H,1-4H3
NCI pathway
Reactome pathway
n/an/a>2.83E+5n/an/an/an/an/an/a
University of Tokyo
Curated by ChEMBL
Assay Description
Inhibitory activity against aminopeptidase N assayed by the L-Ala-MCA method.
J Med Chem 41: 263-5 (1998)
Article DOI: 10.1021/jm970624o
BindingDB Entry DOI: 10.7270/Q24X5BJC
Dipeptidyl peptidase 4
(Homo sapiens (Human))
BDBM50075335
(2-(2,6-Diisopropyl-phenyl)-5-nitro-isoindole-1,3-d...)
Show SMILES CC(C)c1cccc(C(C)C)c1N1C(=O)c2ccc(cc2C1=O)[N+]([O-])=O
Show InChI InChI=1S/C20H20N2O4/c1-11(2)14-6-5-7-15(12(3)4)18(14)21-19(23)16-9-8-13(22(25)26)10-17(16)20(21)24/h5-12H,1-4H3
Reactome pathway
n/an/a>2.84E+5n/an/an/an/an/an/a
University of Tokyo
Curated by ChEMBL
Assay Description
Inhibitory activity against Dipeptidylpeptidase IV (DPP IV) in human acute lymphoblastic leukemia MOLT-4 cell line
Bioorg Med Chem Lett 9: 559-62 (1999)
BindingDB Entry DOI: 10.7270/Q2ZW1MFX
Aminopeptidase
(Homo sapiens (Human))
BDBM50075335
(2-(2,6-Diisopropyl-phenyl)-5-nitro-isoindole-1,3-d...)
Show SMILES CC(C)c1cccc(C(C)C)c1N1C(=O)c2ccc(cc2C1=O)[N+]([O-])=O
Show InChI InChI=1S/C20H20N2O4/c1-11(2)14-6-5-7-15(12(3)4)18(14)21-19(23)16-9-8-13(22(25)26)10-17(16)20(21)24/h5-12H,1-4H3
NCI pathway
Reactome pathway
n/an/a>100n/an/an/an/an/an/a
University of Tokyo
Curated by ChEMBL
Assay Description
Inhibitory activity against aminopeptidase N (APN) in human acute lymphoblastic leukemia MOLT-4 cell line
Bioorg Med Chem Lett 9: 559-62 (1999)
BindingDB Entry DOI: 10.7270/Q2ZW1MFX