BDBM50075337 2-(2,6-Dimethyl-phenyl)-4-nitro-isoindole-1,3-dione::CHEMBL152529
SMILES: Cc1cccc(C)c1N1C(=O)c2cccc(c2C1=O)[N+]([O-])=O
InChI Key: InChIKey=HEMNMVRZSYQCJL-UHFFFAOYSA-N
Data: 3 IC50
Activity Spreadsheet -- Enzyme Inhibition Constant Data from BindingDB
Found 3 hits for monomerid = 50075337
Trg + Lig
Ki
nM
ΔG°
kcal/mole
IC50
nM
Kd
nM
EC50/IC50
nM
koff
s-1
kon
M-1s-1
pHTemp
°C
Dipeptidyl peptidase 4
(Homo sapiens (Human))
BDBM50075337
(2-(2,6-Dimethyl-phenyl)-4-nitro-isoindole-1,3-dion...)
Show SMILES Cc1cccc(C)c1N1C(=O)c2cccc(c2C1=O)[N+]([O-])=O
Show InChI InChI=1S/C16H12N2O4/c1-9-5-3-6-10(2)14(9)17-15(19)11-7-4-8-12(18(21)22)13(11)16(17)20/h3-8H,1-2H3
Reactome pathway
n/an/a>3.38E+5n/an/an/an/an/an/a
University of Tokyo
Curated by ChEMBL
Assay Description
Inhibitory activity against Dipeptidylpeptidase IV (DPP IV) in human acute lymphoblastic leukemia MOLT-4 cell line
Bioorg Med Chem Lett 9: 559-62 (1999)
BindingDB Entry DOI: 10.7270/Q2ZW1MFX
Dipeptidyl peptidase 4
(Homo sapiens (Human))
BDBM50075337
(2-(2,6-Dimethyl-phenyl)-4-nitro-isoindole-1,3-dion...)
Show SMILES Cc1cccc(C)c1N1C(=O)c2cccc(c2C1=O)[N+]([O-])=O
Show InChI InChI=1S/C16H12N2O4/c1-9-5-3-6-10(2)14(9)17-15(19)11-7-4-8-12(18(21)22)13(11)16(17)20/h3-8H,1-2H3
Reactome pathway
n/an/a>100n/an/an/an/an/an/a
University of Tokyo
Curated by ChEMBL
Assay Description
Inhibitory activity against Dipeptidylpeptidase IV (DPP IV) in human acute lymphoblastic leukemia MOLT-4 cell line
Bioorg Med Chem Lett 9: 559-62 (1999)
BindingDB Entry DOI: 10.7270/Q2ZW1MFX
Aminopeptidase
(Homo sapiens (Human))
BDBM50075337
(2-(2,6-Dimethyl-phenyl)-4-nitro-isoindole-1,3-dion...)
Show SMILES Cc1cccc(C)c1N1C(=O)c2cccc(c2C1=O)[N+]([O-])=O
Show InChI InChI=1S/C16H12N2O4/c1-9-5-3-6-10(2)14(9)17-15(19)11-7-4-8-12(18(21)22)13(11)16(17)20/h3-8H,1-2H3
NCI pathway
Reactome pathway
n/an/a>100n/an/an/an/an/an/a
University of Tokyo
Curated by ChEMBL
Assay Description
Inhibitory activity against aminopeptidase N (APN) in human acute lymphoblastic leukemia MOLT-4 cell line
Bioorg Med Chem Lett 9: 559-62 (1999)
BindingDB Entry DOI: 10.7270/Q2ZW1MFX