BDBM50075421 7-(Ethyl-methanesulfonyl-amino)-1-(2-methoxy-benzyl)-4-(4-methoxy-phenyl)-2-oxo-1,2-dihydro-benzo[4,5]furo[3,2-b]pyridine-3-carboxylic acid::CHEMBL433700
SMILES: CCN(c1ccc2c(c1)oc1c(-c3ccc(OC)cc3)c(C(O)=O)c(=O)n(Cc3ccccc3OC)c21)S(C)(=O)=O
InChI Key: InChIKey=XERXKSBDJRNRHE-UHFFFAOYSA-N
Data: 2 IC50
Activity Spreadsheet -- Enzyme Inhibition Constant Data from BindingDB
Found 2 hits for monomerid = 50075421
Trg + Lig
Ki
nM
ΔG°
kcal/mole
IC50
nM
Kd
nM
EC50/IC50
nM
koff
s-1
kon
M-1s-1
pHTemp
°C
EDNRB
(Homo sapiens (Human))
BDBM50075421
(7-(Ethyl-methanesulfonyl-amino)-1-(2-methoxy-benzy...)
Show SMILES CCN(c1ccc2c(c1)oc1c(-c3ccc(OC)cc3)c(C(O)=O)c(=O)n(Cc3ccccc3OC)c21)S(C)(=O)=O
Show InChI InChI=1S/C30H28N2O8S/c1-5-32(41(4,36)37)20-12-15-22-24(16-20)40-28-25(18-10-13-21(38-2)14-11-18)26(30(34)35)29(33)31(27(22)28)17-19-8-6-7-9-23(19)39-3/h6-16H,5,17H2,1-4H3,(H,34,35)
n/an/a 3.60n/an/an/an/an/an/a
Merck KGaA
Curated by ChEMBL
Assay Description
Ability to displace [125I]-Endothelin-1 from endothelin B receptor in porcine kidney membranes
Bioorg Med Chem Lett 9: 619-22 (1999)
BindingDB Entry DOI: 10.7270/Q2DB811P
EDNRA
(RAT)
BDBM50075421
(7-(Ethyl-methanesulfonyl-amino)-1-(2-methoxy-benzy...)
Show SMILES CCN(c1ccc2c(c1)oc1c(-c3ccc(OC)cc3)c(C(O)=O)c(=O)n(Cc3ccccc3OC)c21)S(C)(=O)=O
Show InChI InChI=1S/C30H28N2O8S/c1-5-32(41(4,36)37)20-12-15-22-24(16-20)40-28-25(18-10-13-21(38-2)14-11-18)26(30(34)35)29(33)31(27(22)28)17-19-8-6-7-9-23(19)39-3/h6-16H,5,17H2,1-4H3,(H,34,35)
Reactome pathway
n/an/a>1.00E+4n/an/an/an/an/an/a
Merck KGaA
Curated by ChEMBL
Assay Description
Ability to displace [125I]-Endothelin-1 from endothelin A receptor in rat aorta membranes
Bioorg Med Chem Lett 9: 619-22 (1999)
BindingDB Entry DOI: 10.7270/Q2DB811P