null
SMILES: Clc1ccc(cc1)-c1nc(SCC#C)nc(Cl)c1C#N
InChI Key: InChIKey=PIUJGISMLABOQD-UHFFFAOYSA-N
Activity Spreadsheet -- Enzyme Inhibition Constant Data from BindingDB
Found 3 hits for monomerid = 50075482
Trg + Lig
Ki
nM
ΔG°
kcal/mole
IC50
nM
Kd
nM
EC50/IC50
nM
koff
s-1
kon
M-1s-1
pHTemp
°C
Lysine-specific histone demethylase 1A
(Homo sapiens (Human))
BDBM50075482
(CHEMBL3415545)
Show SMILES Clc1ccc(cc1)-c1nc(SCC#C)nc(Cl)c1C#N
Show InChI InChI=1S/C14H7Cl2N3S/c1-2-7-20-14-18-12(11(8-17)13(16)19-14)9-3-5-10(15)6-4-9/h1,3-6H,7H2
Reactome pathway
n/an/a 8.33E+3n/an/an/an/an/an/a
Zhengzhou University
Curated by ChEMBL
Assay Description
Inhibition of recombinant LSD1 (157 to 852) (unknown origin) transfected in Escherichia coli BL21(DE) by fluorescence assay
J Med Chem 58: 1705-16 (2015)
Article DOI: 10.1021/acs.jmedchem.5b00037
BindingDB Entry DOI: 10.7270/Q2CC12CZ
Lysine-specific histone demethylase 1A
(Homo sapiens (Human))
BDBM50075482
(CHEMBL3415545)
Show SMILES Clc1ccc(cc1)-c1nc(SCC#C)nc(Cl)c1C#N
Show InChI InChI=1S/C14H7Cl2N3S/c1-2-7-20-14-18-12(11(8-17)13(16)19-14)9-3-5-10(15)6-4-9/h1,3-6H,7H2
Reactome pathway
n/an/a 8.33E+3n/an/an/an/an/an/a
Collaborative Innovation Center of New Drug Research and Safety Evaluation, Henan Province, Key Laboratory of Technology of Drug Preparation (Zhengzhou University), Ministry of Education of China, Ke
Curated by ChEMBL
Assay Description
Inhibition of LSD1 (unknown origin)
Bioorg Med Chem Lett 27: 3521-3528 (2017)
Article DOI: 10.1016/j.bmcl.2017.05.065
BindingDB Entry DOI: 10.7270/Q2SB486Q
Lysine-specific histone demethylase 1A
(Homo sapiens (Human))
BDBM50075482
(CHEMBL3415545)
Show SMILES Clc1ccc(cc1)-c1nc(SCC#C)nc(Cl)c1C#N
Show InChI InChI=1S/C14H7Cl2N3S/c1-2-7-20-14-18-12(11(8-17)13(16)19-14)9-3-5-10(15)6-4-9/h1,3-6H,7H2
Reactome pathway
n/an/a 8.34E+3n/an/an/an/an/an/a
Collaborative Innovation Center of New Drug Research and Safety Evaluation, Henan Province, Key Laboratory of Technology of Drug Preparation (Zhengzhou University), Ministry of Education of China, Ke
Curated by ChEMBL
Assay Description
Inhibition of LSD1 (unknown origin)
Bioorg Med Chem Lett 27: 3521-3528 (2017)
Article DOI: 10.1016/j.bmcl.2017.05.065
BindingDB Entry DOI: 10.7270/Q2SB486Q