BDBM50075531 5-(3,5-Di-tert-butyl-4-hydroxy-phenyl)-[1,3,4]oxadiazol-2-yl-cyanamide::CHEMBL16814
SMILES: CC(C)(C)c1cc(cc(c1O)C(C)(C)C)-c1nnc(NC#N)o1
InChI Key: InChIKey=XHFSJZHATNKAKR-UHFFFAOYSA-N
Data: 4 IC50
Activity Spreadsheet -- Enzyme Inhibition Constant Data from BindingDB
Found 4 hits for monomerid = 50075531
Trg + Lig
Ki
nM
ΔG°
kcal/mole
IC50
nM
Kd
nM
EC50/IC50
nM
koff
s-1
kon
M-1s-1
pHTemp
°C
Cyclooxygenase-1 (COX-1)
(Homo sapiens (Human))
BDBM50075531
(5-(3,5-Di-tert-butyl-4-hydroxy-phenyl)-[1,3,4]oxad...)
Show SMILES CC(C)(C)c1cc(cc(c1O)C(C)(C)C)-c1nnc(NC#N)o1
Show InChI InChI=1S/C17H22N4O2/c1-16(2,3)11-7-10(8-12(13(11)22)17(4,5)6)14-20-21-15(23-14)19-9-18/h7-8,22H,1-6H3,(H,19,21)
n/an/a 5.80E+3n/an/an/an/an/an/a
Warner-Lambert Company
Curated by ChEMBL
Assay Description
IC50 value against Prostaglandin G/H synthase 1 of human platelet rich plasma
J Med Chem 42: 1161-9 (1999)
Article DOI: 10.1021/jm980570y
BindingDB Entry DOI: 10.7270/Q2154G6N
Cyclooxygenase
(Homo sapiens (Human))
BDBM50075531
(5-(3,5-Di-tert-butyl-4-hydroxy-phenyl)-[1,3,4]oxad...)
Show SMILES CC(C)(C)c1cc(cc(c1O)C(C)(C)C)-c1nnc(NC#N)o1
Show InChI InChI=1S/C17H22N4O2/c1-16(2,3)11-7-10(8-12(13(11)22)17(4,5)6)14-20-21-15(23-14)19-9-18/h7-8,22H,1-6H3,(H,19,21)
NCI pathway
Reactome pathway
n/an/a 1.10E+4n/an/an/an/an/an/a
Warner-Lambert Company
Curated by ChEMBL
Assay Description
Inhibition of recombinant human prostaglandin G/H synthase 2 (COX-2)
J Med Chem 42: 1161-9 (1999)
Article DOI: 10.1021/jm980570y
BindingDB Entry DOI: 10.7270/Q2154G6N
Cyclooxygenase-2 (COX-2)
(Mus musculus (Mouse))
BDBM50075531
(5-(3,5-Di-tert-butyl-4-hydroxy-phenyl)-[1,3,4]oxad...)
Show SMILES CC(C)(C)c1cc(cc(c1O)C(C)(C)C)-c1nnc(NC#N)o1
Show InChI InChI=1S/C17H22N4O2/c1-16(2,3)11-7-10(8-12(13(11)22)17(4,5)6)14-20-21-15(23-14)19-9-18/h7-8,22H,1-6H3,(H,19,21)
n/an/a 390n/an/an/an/an/an/a
Warner-Lambert Company
Curated by ChEMBL
Assay Description
IC50 value against Prostaglandin G/H synthase 2 of murine J774A.1 cell line
J Med Chem 42: 1161-9 (1999)
Article DOI: 10.1021/jm980570y
BindingDB Entry DOI: 10.7270/Q2154G6N
Cyclooxygenase-1 (COX-1)
(Homo sapiens (Human))
BDBM50075531
(5-(3,5-Di-tert-butyl-4-hydroxy-phenyl)-[1,3,4]oxad...)
Show SMILES CC(C)(C)c1cc(cc(c1O)C(C)(C)C)-c1nnc(NC#N)o1
Show InChI InChI=1S/C17H22N4O2/c1-16(2,3)11-7-10(8-12(13(11)22)17(4,5)6)14-20-21-15(23-14)19-9-18/h7-8,22H,1-6H3,(H,19,21)
n/an/a 390n/an/an/an/an/an/a
Warner-Lambert Company
Curated by ChEMBL
Assay Description
IC50 value against ovine Prostaglandin G/H synthase 1
J Med Chem 42: 1161-9 (1999)
Article DOI: 10.1021/jm980570y
BindingDB Entry DOI: 10.7270/Q2154G6N