BDBM50075585 CHEMBL3415576
SMILES: Fc1ccc(CNCCCCCCCCN2C(=O)c3ccccc3C2=O)c(F)c1
InChI Key: InChIKey=ZCXKNMJBIIVQIS-UHFFFAOYSA-N
Data: 3 IC50
Activity Spreadsheet -- Enzyme Inhibition Constant Data from BindingDB
Found 3 hits for monomerid = 50075585
Trg + Lig
Ki
nM
ΔG°
kcal/mole
IC50
nM
Kd
nM
EC50/IC50
nM
koff
s-1
kon
M-1s-1
pHTemp
°C
Butyrylcholinesterase (BuChE)
(Equus caballus (Horse))
BDBM50075585
(CHEMBL3415576)
Show SMILES Fc1ccc(CNCCCCCCCCN2C(=O)c3ccccc3C2=O)c(F)c1
Show InChI InChI=1S/C23H26F2N2O2/c24-18-12-11-17(21(25)15-18)16-26-13-7-3-1-2-4-8-14-27-22(28)19-9-5-6-10-20(19)23(27)29/h5-6,9-12,15,26H,1-4,7-8,13-14,16H2
n/an/a 1.06E+3n/an/an/an/an/an/a
Jagiellonian University Medical College
Curated by ChEMBL
Assay Description
Inhibition of equine serum BuChE after 5 mins by Ellman's method
Eur J Med Chem 92: 738-49 (2015)
Article DOI: 10.1016/j.ejmech.2015.01.027
BindingDB Entry DOI: 10.7270/Q23T9JXZ
Acetylcholinesterase
(Homo sapiens (Human))
BDBM50075585
(CHEMBL3415576)
Show SMILES Fc1ccc(CNCCCCCCCCN2C(=O)c3ccccc3C2=O)c(F)c1
Show InChI InChI=1S/C23H26F2N2O2/c24-18-12-11-17(21(25)15-18)16-26-13-7-3-1-2-4-8-14-27-22(28)19-9-5-6-10-20(19)23(27)29/h5-6,9-12,15,26H,1-4,7-8,13-14,16H2
NCI pathway
Reactome pathway
n/an/a 578n/an/an/an/an/an/a
Jagiellonian University Medical College
Curated by ChEMBL
Assay Description
Inhibition of human recombinant AChE after 5 mins by Ellman's method
Eur J Med Chem 92: 738-49 (2015)
Article DOI: 10.1016/j.ejmech.2015.01.027
BindingDB Entry DOI: 10.7270/Q23T9JXZ
Acetylcholinesterase
(Electrophorus electricus (Electric eel))
BDBM50075585
(CHEMBL3415576)
Show SMILES Fc1ccc(CNCCCCCCCCN2C(=O)c3ccccc3C2=O)c(F)c1
Show InChI InChI=1S/C23H26F2N2O2/c24-18-12-11-17(21(25)15-18)16-26-13-7-3-1-2-4-8-14-27-22(28)19-9-5-6-10-20(19)23(27)29/h5-6,9-12,15,26H,1-4,7-8,13-14,16H2
n/an/a 601n/an/an/an/an/an/a
Jagiellonian University Medical College
Curated by ChEMBL
Assay Description
Inhibition of Electrophorus electricus AChE after 5 mins by Ellman's method
Eur J Med Chem 92: 738-49 (2015)
Article DOI: 10.1016/j.ejmech.2015.01.027
BindingDB Entry DOI: 10.7270/Q23T9JXZ