BDBM50075847 (S)-2-{[5-(2-Isoquinolin-4-yl-vinyl)-2'-methyl-biphenyl-2-carbonyl]-amino}-4-methylsulfanyl-butyric acid::CHEMBL164366
SMILES: CSCC[C@H](NC(=O)c1ccc(\C=C\c2cncc3ccccc23)cc1-c1ccccc1C)C(O)=O
InChI Key: InChIKey=ZGXXVZOEOVXKNI-LCIVRZSQSA-N
Data: 1 IC50
Activity Spreadsheet -- Enzyme Inhibition Constant Data from BindingDB
Found 1 hit for monomerid = 50075847
Trg + Lig
Ki
nM
ΔG°
kcal/mole
IC50
nM
Kd
nM
EC50/IC50
nM
koff
s-1
kon
M-1s-1
pHTemp
°C
Protein Farnesyltransferase (PFT)
(Homo sapiens (Human))
BDBM50075847
((S)-2-{[5-(2-Isoquinolin-4-yl-vinyl)-2'-methyl-bip...)
Show SMILES CSCC[C@H](NC(=O)c1ccc(\C=C\c2cncc3ccccc23)cc1-c1ccccc1C)C(O)=O
Show InChI InChI=1S/C30H28N2O3S/c1-20-7-3-5-9-24(20)27-17-21(11-13-23-19-31-18-22-8-4-6-10-25(22)23)12-14-26(27)29(33)32-28(30(34)35)15-16-36-2/h3-14,17-19,28H,15-16H2,1-2H3,(H,32,33)(H,34,35)/b13-11+/t28-/m0/s1
Reactome pathway
n/an/a 0.800n/an/an/an/an/an/a
Abbott Laboratories
Curated by ChEMBL
Assay Description
Inhibitory activity against farnesyltransferase (FT) using SPA assay
Bioorg Med Chem Lett 9: 703-8 (1999)
BindingDB Entry DOI: 10.7270/Q2G73CWQ