BDBM50075922 CHEMBL3415606
SMILES: N[C@H]1CCCC[C@H]1Nc1cnc(C(N)=O)c(Nc2cccc(n2)-n2nccn2)c1
InChI Key: InChIKey=FUEPXJJVRBOKRN-UONOGXRCSA-N
Data: 1 IC50
Activity Spreadsheet -- Enzyme Inhibition Constant Data from BindingDB
Found 1 hit for monomerid = 50075922
Trg + Lig
Ki
nM
ΔG°
kcal/mole
IC50
nM
Kd
nM
EC50/IC50
nM
koff
s-1
kon
M-1s-1
pHTemp
°C
Tyrosine-protein kinase SYK
(Homo sapiens (Human))
BDBM50075922
(CHEMBL3415606)
Show SMILES N[C@H]1CCCC[C@H]1Nc1cnc(C(N)=O)c(Nc2cccc(n2)-n2nccn2)c1 |r|
Show InChI InChI=1S/C19H23N9O/c20-13-4-1-2-5-14(13)25-12-10-15(18(19(21)29)22-11-12)26-16-6-3-7-17(27-16)28-23-8-9-24-28/h3,6-11,13-14,25H,1-2,4-5,20H2,(H2,21,29)(H,26,27)/t13-,14+/m0/s1
NCI pathway
Reactome pathway
n/an/a 0.100n/an/an/an/an/an/a
Merck & Co., Inc.
Curated by ChEMBL
Assay Description
Inhibition of full-length GST-tagged human Syk preincubated for 10 mins followed by peptide substrate/ATP addition measured after 45 mins by TR-FRET ...
J Med Chem 58: 1929-39 (2015)
Article DOI: 10.1021/jm5018169
BindingDB Entry DOI: 10.7270/Q2028T7D