BDBM50075944 CHEMBL3415609::US9775839, 3.1
SMILES: N[C@H]1CCS(=O)(=O)C[C@H]1Nc1cnc(C(N)=O)c(n1)-c1cc2ccccc2[nH]1
InChI Key:
Data: 2 IC50
Activity Spreadsheet -- Enzyme Inhibition Constant Data from BindingDB
Found 2 hits for monomerid = 50075944
Trg + Lig
Ki
nM
ΔG°
kcal/mole
IC50
nM
Kd
nM
EC50/IC50
nM
koff
s-1
kon
M-1s-1
pHTemp
°C
Tyrosine-protein kinase SYK
(Homo sapiens (Human))
BDBM50075944
(CHEMBL3415609 | US9775839, 3.1)
Show SMILES N[C@H]1CCS(=O)(=O)C[C@H]1Nc1cnc(C(N)=O)c(n1)-c1cc2ccccc2[nH]1 |r|
NCI pathway
Reactome pathway
US Patent
n/an/a 2.5n/an/an/an/an/an/a
Merck Sharp & Dohme Corp.
US Patent
Assay Description
A recombinant GST-hSYK fusion protein was used to measure potency of compounds to inhibit human Syk activity. The recombinant human GST-SYK (Carna Bi...
US Patent US9775839 (2017)
BindingDB Entry DOI: 10.7270/Q2MG7RN9
Tyrosine-protein kinase SYK
(Homo sapiens (Human))
BDBM50075944
(CHEMBL3415609 | US9775839, 3.1)
Show SMILES N[C@H]1CCS(=O)(=O)C[C@H]1Nc1cnc(C(N)=O)c(n1)-c1cc2ccccc2[nH]1 |r|
NCI pathway
Reactome pathway
n/an/a 2.5n/an/an/an/an/an/a
Merck & Co., Inc.
Curated by ChEMBL
Assay Description
Inhibition of full-length GST-tagged human Syk preincubated for 10 mins followed by peptide substrate/ATP addition measured after 45 mins by TR-FRET ...
J Med Chem 58: 1929-39 (2015)
Article DOI: 10.1021/jm5018169
BindingDB Entry DOI: 10.7270/Q2028T7D